{"text_format":"1","workbook":"xlsx","n_sheets":6,"sheets":["Instructions","Steers Graph","Heifers Graph","Results","ckg table","State Lookup"],"not_rendered":{"charts":2,"images":2,"macros":1,"external_links":0,"defined_names":1,"comments":0,"pivot_tables":0},"unopened":[],"bounds":{"document_bytes":16777216,"sheet_cells":100000,"rows_first":2000,"rows_last":500,"rows_between":2000,"halvings":0,"cell_chars":16384,"cell_head_chars":4096},"cells_cut":0,"cells_raw":0,"read":"whole","date_system":"1900"}

{"sheet":"Instructions","index":0,"n_rows":3,"n_cols":2,"rows_kept":3,"cut":false,"hidden":false,"merged":[]}
["Step","Description"]
[1,"Delete all data sitting in the \"Results\" tab including HEADINGS! Then copy across this week's data. Click \"Ctrl+S\" to prompt the spreadsheet to make its calculations"]
[2,"The green tabs contain the graphs. You will need to add this week's calculated data to the graph data by clicking the button you find in those tabs"]

{"sheet":"Steers Graph","index":1,"n_rows":26,"n_cols":27,"rows_kept":26,"cut":false,"hidden":false,"merged":[]}
[null,null,null,"Steers Graphs"]
[null,null,null,"Rolling 15 Weeks"]
[]
[]
[null,null,"This Week"]
[null,null,"No Touchy! - Calculated Field",null,null,null,null,null,null,null,null,null,null,null,null,null,null,null,null,null,"Weight Min","Weight Max","Sex",null,{"$f":"\"'Results'!\"&IF(MATCH(Y7,INDIRECT(\"Results!1:1\"),0)>=53,\"b\"&CHAR(64+MATCH(Y7,INDIRECT(\"Results!1:1\"),0)-52),IF(MATCH(Y7,INDIRECT(\"Results!1:1\"),0)>=27,\"A\"&CHAR(64+MATCH(Y7,INDIRECT(\"Results!1:1\"),0)-26),CHAR(64+MATCH(Y7,INDIRECT(\"Results!1:1\"),0))))&\":\"&IF(MATCH(Y7,INDIRECT(\"Results!1:1\"),0)>=53,\"b\"&CHAR(64+MATCH(Y7,INDIRECT(\"Results!1:1\"),0)-52),IF(MATCH(Y7,INDIRECT(\"Results!1:1\"),0)>=27,\"A\"&CHAR(64+MATCH(Y7,INDIRECT(\"Results!1:1\"),0)-26),CHAR(64+MATCH(Y7,INDIRECT(\"Results!1:1\"),0))))","v":"'Results'!J:J"}]
[null,null,"Weight Range (kg)","Avg (c/kg)",null,null,null,null,null,null,null,null,null,null,null,null,null,null,null,null,0,250,"Steer",null,"Sex "]
[null,null,"0-249",{"$f":"IFERROR((SUMIFS('ckg table'!$B:$B,INDIRECT($Y$6),$W7,INDIRECT($Y$21),\"<\"&$V7,INDIRECT($Y$21),\">=\"&$U7,INDIRECT($Y$8),\"Sold\",INDIRECT($Y$10),\"<>*Wagyu*\"))/COUNTIFS(INDIRECT($Y$6),$W7,INDIRECT($Y$21),\"<\"&$V7,INDIRECT($Y$21),\">=\"&$U7,INDIRECT($Y$8),\"Sold\",INDIRECT($Y$10),\"<>*Wagyu*\"),0)","v":344.15335999147447},null,null,null,null,null,null,null,null,null,null,null,null,null,null,null,null,250,300,"Steer",null,{"$f":"\"'Results'!\"&IF(MATCH(Y9,INDIRECT(\"Results!1:1\"),0)>=53,\"b\"&CHAR(64+MATCH(Y9,INDIRECT(\"Results!1:1\"),0)-52),IF(MATCH(Y9,INDIRECT(\"Results!1:1\"),0)>=27,\"A\"&CHAR(64+MATCH(Y9,INDIRECT(\"Results!1:1\"),0)-26),CHAR(64+MATCH(Y9,INDIRECT(\"Results!1:1\"),0))))&\":\"&IF(MATCH(Y9,INDIRECT(\"Results!1:1\"),0)>=53,\"b\"&CHAR(64+MATCH(Y9,INDIRECT(\"Results!1:1\"),0)-52),IF(MATCH(Y9,INDIRECT(\"Results!1:1\"),0)>=27,\"A\"&CHAR(64+MATCH(Y9,INDIRECT(\"Results!1:1\"),0)-26),CHAR(64+MATCH(Y9,INDIRECT(\"Results!1:1\"),0))))","v":"'Results'!X:X"}]
[null,null,"250-299",{"$f":"IFERROR((SUMIFS('ckg table'!$B:$B,INDIRECT($Y$6),$W8,INDIRECT($Y$21),\"<\"&$V8,INDIRECT($Y$21),\">=\"&$U8,INDIRECT($Y$8),\"Sold\",INDIRECT($Y$10),\"<>*Wagyu*\"))/COUNTIFS(INDIRECT($Y$6),$W8,INDIRECT($Y$21),\"<\"&$V8,INDIRECT($Y$21),\">=\"&$U8,INDIRECT($Y$8),\"Sold\",INDIRECT($Y$10),\"<>*Wagyu*\"),0)","v":311.1707710761014},null,null,null,null,null,null,null,null,null,null,null,null,null,null,null,null,300,350,"Steer",null,"LotStatus "]
[null,null,"300-349",{"$f":"IFERROR((SUMIFS('ckg table'!$B:$B,INDIRECT($Y$6),$W9,INDIRECT($Y$21),\"<\"&$V9,INDIRECT($Y$21),\">=\"&$U9,INDIRECT($Y$8),\"Sold\",INDIRECT($Y$10),\"<>*Wagyu*\"))/COUNTIFS(INDIRECT($Y$6),$W9,INDIRECT($Y$21),\"<\"&$V9,INDIRECT($Y$21),\">=\"&$U9,INDIRECT($Y$8),\"Sold\",INDIRECT($Y$10),\"<>*Wagyu*\"),0)","v":313.51610350080335},null,null,null,null,null,null,null,null,null,null,null,null,null,null,null,null,350,400,"Steer",null,{"$f":"\"'Results'!\"&IF(MATCH(Y11,INDIRECT(\"Results!1:1\"),0)>=53,\"b\"&CHAR(64+MATCH(Y11,INDIRECT(\"Results!1:1\"),0)-52),IF(MATCH(Y11,INDIRECT(\"Results!1:1\"),0)>=27,\"A\"&CHAR(64+MATCH(Y11,INDIRECT(\"Results!1:1\"),0)-26),CHAR(64+MATCH(Y11,INDIRECT(\"Results!1:1\"),0))))&\":\"&IF(MATCH(Y11,INDIRECT(\"Results!1:1\"),0)>=53,\"b\"&CHAR(64+MATCH(Y11,INDIRECT(\"Results!1:1\"),0)-52),IF(MATCH(Y11,INDIRECT(\"Results!1:1\"),0)>=27,\"A\"&CHAR(64+MATCH(Y11,INDIRECT(\"Results!1:1\"),0)-26),CHAR(64+MATCH(Y11,INDIRECT(\"Results!1:1\"),0))))","v":"'Results'!F:F"}]
[null,null,"350+",{"$f":"IFERROR((SUMIFS('ckg table'!$B:$B,INDIRECT($Y$6),$W10,INDIRECT($Y$21),\">=\"&$U10,INDIRECT($Y$8),\"Sold\",INDIRECT($Y$10),\"<>*Wagyu*\"))/COUNTIFS(INDIRECT($Y$6),$W10,INDIRECT($Y$21),\">=\"&$U10,INDIRECT($Y$8),\"Sold\",INDIRECT($Y$10),\"<>*Wagyu*\"),0)","v":276.57002298590612},null,null,null,null,null,null,null,null,null,null,null,null,null,null,null,null,400,450,"Steer",null,"MajorityBreed "]
[null,null,null,null,null,null,null,null,null,null,null,null,null,null,null,null,null,null,null,null,450,null,"Steer",null,{"$f":"\"'Results'!\"&IF(MATCH(Y13,INDIRECT(\"Results!1:1\"),0)>=53,\"b\"&CHAR(64+MATCH(Y13,INDIRECT(\"Results!1:1\"),0)-52),IF(MATCH(Y13,INDIRECT(\"Results!1:1\"),0)>=27,\"A\"&CHAR(64+MATCH(Y13,INDIRECT(\"Results!1:1\"),0)-26),CHAR(64+MATCH(Y13,INDIRECT(\"Results!1:1\"),0))))&\":\"&IF(MATCH(Y13,INDIRECT(\"Results!1:1\"),0)>=53,\"b\"&CHAR(64+MATCH(Y13,INDIRECT(\"Results!1:1\"),0)-52),IF(MATCH(Y13,INDIRECT(\"Results!1:1\"),0)>=27,\"A\"&CHAR(64+MATCH(Y13,INDIRECT(\"Results!1:1\"),0)-26),CHAR(64+MATCH(Y13,INDIRECT(\"Results!1:1\"),0))))","v":"'Results'!K:K"}]
[null,null,null,null,null,null,null,null,null,null,null,null,null,null,null,null,null,null,null,null,null,null,null,null,"LotBestDescription "]
[]
[]
[]
[]
[]
[]
[null,null,"Graph Data"]
[null,null,"No Touchy! - Calculated Field",null,null,null,null,null,null,null,null,null,null,null,null,null,null,null,null,null,null,null,null,null,{"$f":"\"'Results'!\"&IF(MATCH(Y22,INDIRECT(\"Results!1:1\"),0)>=53,\"b\"&CHAR(64+MATCH(Y22,INDIRECT(\"Results!1:1\"),0)-52),IF(MATCH(Y22,INDIRECT(\"Results!1:1\"),0)>=27,\"A\"&CHAR(64+MATCH(Y22,INDIRECT(\"Results!1:1\"),0)-26),CHAR(64+MATCH(Y22,INDIRECT(\"Results!1:1\"),0))))&\":\"&IF(MATCH(Y22,INDIRECT(\"Results!1:1\"),0)>=53,\"b\"&CHAR(64+MATCH(Y22,INDIRECT(\"Results!1:1\"),0)-52),IF(MATCH(Y22,INDIRECT(\"Results!1:1\"),0)>=27,\"A\"&CHAR(64+MATCH(Y22,INDIRECT(\"Results!1:1\"),0)-26),CHAR(64+MATCH(Y22,INDIRECT(\"Results!1:1\"),0))))","v":"'Results'!M:M"},null,"Under 250kg"]
[null,null,"Weight Range (kg)","2017-10-27","2017-11-03","2017-11-10","2017-11-17","2017-11-24","2017-12-01","2017-12-08","2017-12-15","2018-01-05","2018-01-12","2018-01-19","2018-01-26","2018-02-02","2018-02-09","2018-02-16",null,null,null,null,null,null,"LiveWeight ",null,"250-300kg"]
[null,null,"0-249",398.26936476124069,388.27719538953278,393.48432682150201,348.53692741548701,383.5721506017174,394.81747982182725,365.85892269963057,391.90751289271259,392,402.51651134962572,346.19829258146405,358.01172111725549,368.10687606434817,362.94341745124871,344.15335999147447,null,null,null,null,null,null,null,null,"300-350kg"]
[null,null,"250-299",364.55640096802369,368.25106876986945,366.14063286321959,349.54939141850957,360.87278919040625,370.73207852604952,376.2396270077499,350.68326324466943,346.48927493042629,356.96397806725952,320.0426918742703,342.38511356683961,327.68627763070623,311.55755266230756,311.1707710761014,null,null,null,null,null,null,null,null,"350kg +"]
[null,null,"300-349",350.46961480968338,331.24812233459028,342.02158285802568,339.67060749848986,330.1735733051176,350.03265094287366,333.76443194141149,342.83021899949995,310.43478706484956,326.07713619561497,313.93946325099114,314.69720522137681,297.44158272839167,311.87286662818042,313.51610350080335]
[null,null,"350+",318.06714402422523,316.63063985032613,317.18613274937053,320.01309780322578,322.57923163523901,301.31052027400688,305.81688062363986,327.81731611932526,311.84270838675309,312.0776648551734,291.02522535394883,317.41650565829423,301.91862345084121,252.87631831255993,276.57002298590612]

{"sheet":"Heifers Graph","index":2,"n_rows":26,"n_cols":26,"rows_kept":26,"cut":false,"hidden":false,"merged":[]}
[null,null,null,"Heifers Graphs"]
[null,null,null,"Rolling 15 Weeks"]
[]
[]
[null,null,"This Week"]
[null,null,"No Touchy! - Calculated Field"]
[null,null,"Weight Range","Avg (c/kg)",null,null,null,null,null,null,null,null,null,null,null,null,null,null,null,{"$f":"\"'Results'!\"&IF(MATCH(T8,INDIRECT(\"Results!1:1\"),0)>=53,\"b\"&CHAR(64+MATCH(T8,INDIRECT(\"Results!1:1\"),0)-52),IF(MATCH(T8,INDIRECT(\"Results!1:1\"),0)>=27,\"A\"&CHAR(64+MATCH(T8,INDIRECT(\"Results!1:1\"),0)-26),CHAR(64+MATCH(T8,INDIRECT(\"Results!1:1\"),0))))&\":\"&IF(MATCH(T8,INDIRECT(\"Results!1:1\"),0)>=53,\"b\"&CHAR(64+MATCH(T8,INDIRECT(\"Results!1:1\"),0)-52),IF(MATCH(T8,INDIRECT(\"Results!1:1\"),0)>=27,\"A\"&CHAR(64+MATCH(T8,INDIRECT(\"Results!1:1\"),0)-26),CHAR(64+MATCH(T8,INDIRECT(\"Results!1:1\"),0))))","v":"'Results'!J:J"},null,"Weight Min","Weight Max","Sex"]
[null,null,"0-249",{"$f":"IFERROR((SUMIFS('ckg table'!$B:$B,INDIRECT($T$7),$X8,INDIRECT($T$15),\"<\"&$W8,INDIRECT($T$15),\">=\"&$V8,INDIRECT($T$9),\"Sold\",INDIRECT($T$13),\"<>\"&\"*PTIC*\",INDIRECT($T$13),\"<>\"&\"*Station Mated*\",INDIRECT($T$11),\"<>*Wagyu*\")/COUNTIFS(INDIRECT($T$7),$X8,INDIRECT($T$15),\"<\"&$W8,INDIRECT($T$15),\">=\"&$V8,INDIRECT($T$9),\"Sold\",INDIRECT($T$13),\"<>\"&\"*PTIC*\",INDIRECT($T$13),\"<>\"&\"*Station Mated*\",INDIRECT($T$11),\"<>*Wagyu*\")),0)","v":295.75110364243739},null,null,null,null,null,null,null,null,null,null,null,null,null,null,null,"Sex ",null,0,250,"Heifer"]
[null,null,"250-299",{"$f":"IFERROR((SUMIFS('ckg table'!$B:$B,INDIRECT($T$7),$X9,INDIRECT($T$15),\"<\"&$W9,INDIRECT($T$15),\">=\"&$V9,INDIRECT($T$9),\"Sold\",INDIRECT($T$13),\"<>\"&\"*PTIC*\",INDIRECT($T$13),\"<>\"&\"*Station Mated*\",INDIRECT($T$11),\"<>*Wagyu*\")/COUNTIFS(INDIRECT($T$7),$X9,INDIRECT($T$15),\"<\"&$W9,INDIRECT($T$15),\">=\"&$V9,INDIRECT($T$9),\"Sold\",INDIRECT($T$13),\"<>\"&\"*PTIC*\",INDIRECT($T$13),\"<>\"&\"*Station Mated*\",INDIRECT($T$11),\"<>*Wagyu*\")),0)","v":286.5736226354594},null,null,null,null,null,null,null,null,null,null,null,null,null,null,null,{"$f":"\"'Results'!\"&IF(MATCH(T10,INDIRECT(\"Results!1:1\"),0)>=53,\"b\"&CHAR(64+MATCH(T10,INDIRECT(\"Results!1:1\"),0)-52),IF(MATCH(T10,INDIRECT(\"Results!1:1\"),0)>=27,\"A\"&CHAR(64+MATCH(T10,INDIRECT(\"Results!1:1\"),0)-26),CHAR(64+MATCH(T10,INDIRECT(\"Results!1:1\"),0))))&\":\"&IF(MATCH(T10,INDIRECT(\"Results!1:1\"),0)>=53,\"b\"&CHAR(64+MATCH(T10,INDIRECT(\"Results!1:1\"),0)-52),IF(MATCH(T10,INDIRECT(\"Results!1:1\"),0)>=27,\"A\"&CHAR(64+MATCH(T10,INDIRECT(\"Results!1:1\"),0)-26),CHAR(64+MATCH(T10,INDIRECT(\"Results!1:1\"),0))))","v":"'Results'!X:X"},null,250,300,"Heifer"]
[null,null,"300-349",{"$f":"IFERROR((SUMIFS('ckg table'!$B:$B,INDIRECT($T$7),$X10,INDIRECT($T$15),\"<\"&$W10,INDIRECT($T$15),\">=\"&$V10,INDIRECT($T$9),\"Sold\",INDIRECT($T$13),\"<>\"&\"*PTIC*\",INDIRECT($T$13),\"<>\"&\"*Station Mated*\",INDIRECT($T$11),\"<>*Wagyu*\")/COUNTIFS(INDIRECT($T$7),$X10,INDIRECT($T$15),\"<\"&$W10,INDIRECT($T$15),\">=\"&$V10,INDIRECT($T$9),\"Sold\",INDIRECT($T$13),\"<>\"&\"*PTIC*\",INDIRECT($T$13),\"<>\"&\"*Station Mated*\",INDIRECT($T$11),\"<>*Wagyu*\")),0)","v":284.79063153570991},null,null,null,null,null,null,null,null,null,null,null,null,null,null,null,"LotStatus ",null,300,350,"Heifer"]
[null,null,"350+",{"$f":"IFERROR((SUMIFS('ckg table'!$B:$B,INDIRECT($T$7),$X11,INDIRECT($T$15),\">=\"&$V11,INDIRECT($T$9),\"Sold\",INDIRECT($T$13),\"<>\"&\"*PTIC*\",INDIRECT($T$13),\"<>\"&\"*Station Mated*\",INDIRECT($T$11),\"<>*Wagyu*\")/COUNTIFS(INDIRECT($T$7),$X11,INDIRECT($T$15),\">=\"&$V11,INDIRECT($T$9),\"Sold\",INDIRECT($T$13),\"<>\"&\"*PTIC*\",INDIRECT($T$13),\"<>\"&\"*Station Mated*\",INDIRECT($T$11),\"<>*Wagyu*\")),0)","v":256.64381495768748},null,null,null,null,null,null,null,null,null,null,null,null,null,null,null,{"$f":"\"'Results'!\"&IF(MATCH(T12,INDIRECT(\"Results!1:1\"),0)>=53,\"b\"&CHAR(64+MATCH(T12,INDIRECT(\"Results!1:1\"),0)-52),IF(MATCH(T12,INDIRECT(\"Results!1:1\"),0)>=27,\"A\"&CHAR(64+MATCH(T12,INDIRECT(\"Results!1:1\"),0)-26),CHAR(64+MATCH(T12,INDIRECT(\"Results!1:1\"),0))))&\":\"&IF(MATCH(T12,INDIRECT(\"Results!1:1\"),0)>=53,\"b\"&CHAR(64+MATCH(T12,INDIRECT(\"Results!1:1\"),0)-52),IF(MATCH(T12,INDIRECT(\"Results!1:1\"),0)>=27,\"A\"&CHAR(64+MATCH(T12,INDIRECT(\"Results!1:1\"),0)-26),CHAR(64+MATCH(T12,INDIRECT(\"Results!1:1\"),0))))","v":"'Results'!F:F"},null,350,null,"Heifer"]
[null,null,null,null,null,null,null,null,null,null,null,null,null,null,null,null,null,null,null,"MajorityBreed "]
[null,null,null,null,null,null,null,null,null,null,null,null,null,null,null,null,null,null,null,{"$f":"\"'Results'!\"&IF(MATCH(T14,INDIRECT(\"Results!1:1\"),0)>=53,\"b\"&CHAR(64+MATCH(T14,INDIRECT(\"Results!1:1\"),0)-52),IF(MATCH(T14,INDIRECT(\"Results!1:1\"),0)>=27,\"A\"&CHAR(64+MATCH(T14,INDIRECT(\"Results!1:1\"),0)-26),CHAR(64+MATCH(T14,INDIRECT(\"Results!1:1\"),0))))&\":\"&IF(MATCH(T14,INDIRECT(\"Results!1:1\"),0)>=53,\"b\"&CHAR(64+MATCH(T14,INDIRECT(\"Results!1:1\"),0)-52),IF(MATCH(T14,INDIRECT(\"Results!1:1\"),0)>=27,\"A\"&CHAR(64+MATCH(T14,INDIRECT(\"Results!1:1\"),0)-26),CHAR(64+MATCH(T14,INDIRECT(\"Results!1:1\"),0))))","v":"'Results'!K:K"}]
[null,null,null,null,null,null,null,null,null,null,null,null,null,null,null,null,null,null,null,"LotBestDescription "]
[null,null,null,null,null,null,null,null,null,null,null,null,null,null,null,null,null,null,null,{"$f":"\"'Results'!\"&IF(MATCH(T16,INDIRECT(\"Results!1:1\"),0)>=53,\"b\"&CHAR(64+MATCH(T16,INDIRECT(\"Results!1:1\"),0)-52),IF(MATCH(T16,INDIRECT(\"Results!1:1\"),0)>=27,\"A\"&CHAR(64+MATCH(T16,INDIRECT(\"Results!1:1\"),0)-26),CHAR(64+MATCH(T16,INDIRECT(\"Results!1:1\"),0))))&\":\"&IF(MATCH(T16,INDIRECT(\"Results!1:1\"),0)>=53,\"b\"&CHAR(64+MATCH(T16,INDIRECT(\"Results!1:1\"),0)-52),IF(MATCH(T16,INDIRECT(\"Results!1:1\"),0)>=27,\"A\"&CHAR(64+MATCH(T16,INDIRECT(\"Results!1:1\"),0)-26),CHAR(64+MATCH(T16,INDIRECT(\"Results!1:1\"),0))))","v":"'Results'!M:M"}]
[null,null,null,null,null,null,null,null,null,null,null,null,null,null,null,null,null,null,null,"LiveWeight "]
[]
[]
[]
[null,null,"Graph Data"]
[null,null,"No Touchy! - Calculated Field"]
[null,null,"Weight Range (kg)","2017-10-27","2017-11-03","2017-11-10","2017-11-17","2017-11-24","2017-12-01","2017-12-08","2017-12-15","2018-01-05","2018-01-12","2018-01-19","2018-01-26","2018-02-02","2018-02-09","2018-02-16",null,null,null,null,null,null,null,"Under 250kg"]
[null,null,"0-249",373.93838533771788,360.37066284370053,337,327.71506753423006,321.06705677832434,360.54064142676577,372.67691207943585,395.41330866097968,372.56763170384437,351.95833458771108,321.29389477379544,303.72613360752109,317.4785456308278,291.34987316390334,295.75110364243739,null,null,null,null,null,null,null,"250-300kg"]
[null,null,"250-299",327.74434378937798,315.2509670247768,320,325.12952518519097,323.55035106805735,342.05877108660673,331.321336436732,308.84080263248649,302.68232437489303,322.98281384214619,261.08367695537549,304.06559617355657,298.42441640198666,284.86537610112271,286.5736226354594,null,null,null,null,null,null,null,"300-350kg"]
[null,null,"300-349",324.64473838778372,307.62806604606192,316,309.81845732613516,306.8397178036534,320.48043671791589,329.22455312346938,304.68459314866698,281.2026949348737,313.56336088248156,276.53880463871542,258.15647766867278,278.46818071154246,293.53820232395174,284.79063153570991,null,null,null,null,null,null,null,"350kg +"]
[null,null,"350+",312.1734067222082,309.4635589271233,317,296.60269614632324,287.49984345642133,285.58996109482996,297.48673181660894,293.60795783565538,300.25773195876286,288.85322704968144,282.9508310319905,270.14104709538611,285.76384534891503,285.37002174317752,256.64381495768748]

{"sheet":"Results","index":3,"n_rows":195,"n_cols":29,"rows_kept":195,"cut":false,"hidden":false,"merged":[]}
["AssessmentNumber ","LotNumber ","LotIdentifier ","NumberOfHead ","StockCategory ","MajorityBreed ","MajorityBreedPercentage ","MajorityFat ","MajorityFatPercentage ","Sex ","LotBestDescription ","InWitholdingOrESI ","LiveWeight ","DressedWeight ","AgeRange","Age ","EarliestDrop ","LatestDrop ","DeliveryTown ","DeliveryRegion ","StartPrice ","ReservePrice ","BidPrice ","LotStatus ","HighBidderTradingName ","HighBidderLat","HighBidderLong","HighBidderTown ","HighBidderState "]
[8264694,800,"Lot 800",80,"Weaners","Red Angus/Brahman Cross",78,"2 L",65,"Steer","Weaned Steers",false,210.2,115.8,"Months","6 to 9",null,null,"RICHMOND","North Queensland",565,670,630,"Passed In","Nogoa Pastoral Pty Ltd",-23.523,148.15799999999999,"EMERALD","QLD"]
[8264708,801,"Lot 801",120,"Weaners","Brahman/Brahman",100,"2 L",87,"Steer","Weaned Steers",false,207.6,114.4,"Months","6 to 9",null,null,"RICHMOND","North Queensland",560,665,625,"Passed In","Nogoa Pastoral Pty Ltd",-23.523,148.15799999999999,"EMERALD","QLD"]
[8266263,802,"Lot 802",175,"Weaners","Brahman/Brahman",57,"2 L",100,"Steer","Weaned Steers",false,206.5,99.1,"Months","12 to 14",null,null,"CORFIELD","Western Queensland",630,650,635,"Passed In","JACK MCDONALD PTY LTD",-28.546399999999998,150.30699999999999,"GOONDIWINDI","QLD"]
[8266310,803,"Lot 803",175,"Weaners","Brahman/Brahman Cross",34,"2 L",100,"Steer","Weaned Steers",false,226.3,108.6,"Months","12 to 14",null,null,"CORFIELD","Western Queensland",690,710,695,"Passed In","A.J. BRITTON AND A.P. MCAULEY",-22.381900000000002,143.042,"WINTON","QLD"]
[8266360,804,"Lot 804",112,"Weaners","Angus/Brahman",54,"2 L",100,"Steer","Weaned Steers",false,234.4,112.5,"Months","12 to 14",null,null,"CORFIELD","Western Queensland",730,750,735,"Passed In","A.J. BRITTON AND A.P. MCAULEY",-22.381900000000002,143.042,"WINTON","QLD"]
[8266182,805,"Lot 805",180,"Weaners","Brahman/Brahman",56,"2 L",100,"Heifer","Weaned Heifers",false,187.6,90.1,"Months","12 to 14",null,null,"CORFIELD","Western Queensland",480,500,500,"Sold","TRUE NORTH PASTORAL PTY LTD ",-14.4649669,132.26425610000001,"KATHERINE","NT"]
[8266220,806,"Lot 806",180,"Weaners","Brahman/Brahman",56,"2 L",100,"Heifer","Weaned Heifers",false,211.1,101.3,"Months","12 to 14",null,null,"CORFIELD","Western Queensland",560,580,570,"Passed In","A.J. BRITTON AND A.P. MCAULEY",-22.381900000000002,143.042,"WINTON","QLD"]
[8266247,807,"Lot 807",120,"Weaners","Angus/Brahman Cross",50,"2 L",100,"Heifer","Weaned Heifers",false,235.1,112.8,"Months","12 to 14",null,null,"CORFIELD","Western Queensland",630,650,630,"No Bids","UNK",null,null,"UNK","UNK"]
[8265887,808,"Lot 808",126,"Weaners","Droughtmaster/Droughtmaster",99,"3 L",72,"Heifer","Weaned Heifers",false,224,119.1,"Months","5 to 7",null,null,"WINTON","Western Queensland",600,620,620,"Sold","ALLIED BEEF",-27.560600000000001,151.95400000000001,"TOOWOOMBA","QLD"]
[8265895,809,"Lot 809",120,"Weaners","Droughtmaster/Droughtmaster",100,"2 H",72,"Steer","Weaned Steers",false,230,122.3,"Months","5 to 7",null,null,"WINTON","Western Queensland",695,720,770,"Sold","HOURN & BISHOP QLD PTY LTD",-24.572199999999999,149.96700000000001,"MOURA","QLD"]
[8266000,810,"Lot 810",80,"Steers","Santa Gertrudis/Santa/Brahman",75,2,100,"Steer","Backgrounder Steers",false,282,148.4,"Months","6 to 15",null,null,"MUTTABURRA","Western Queensland",800,870,null,"No Bids"]
[8266077,811,"Lot 811",74,"Heifers","Santa Gertrudis/Santa Cross",64,2,100,"Heifer","Backgrounder Heifers",false,284.10000000000002,149.5,"Months","6 to 15",null,null,"MUTTABURRA","Western Queensland",748,780,null,"No Bids"]
[8265062,812,"Lot 812",114,"Weaners","Brahman/Brahman Cross",51,"2 L",100,"Steer","Weaned Steers",false,276.10000000000002,143.6,"Months","12 to 14",null,null,"SPRINGSURE","Central Queensland",850.91,855.91,855.91,"Sold","MCC PASTORAL PTY LTD",-24.463100000000001,148.624,"ROLLESTON","QLD"]
[8264929,813,"Lot 813",80,"Heifers","Santa Gertrudis/Santa Gertrudis",70,1,93,"Heifer","Backgrounder Heifers",false,258.39999999999998,136,"Months","7 to 10",null,null,"MUNDUBBERA","Southern Queensland",720,775,755,"Passed In","HOURN & BISHOP QLD PTY LTD",-24.572199999999999,149.96700000000001,"MOURA","QLD"]
[8264937,814,"Lot 814",35,"Heifers","Angus/Angus Cross",66,1,91,"Heifer","Backgrounder Heifers",false,245.3,129.1,"Months","7 to 10",null,null,"MUNDUBBERA","Southern Queensland",680,735,755,"Sold","ALLIED BEEF",-27.560600000000001,151.95400000000001,"TOOWOOMBA","QLD"]
[8265070,815,"Lot 815",24,"Heifers","Droughtmaster/Droughtmaster",38,1,92,"Heifer","Feeder Heifers",false,322.3,174.9,"Months","10 to 14",null,null,"IRONPOT","Southern Queensland",850,900,null,"No Bids"]
[8265119,816,"Lot 816",26,"Heifers","Droughtmaster/Droughtmaster",27,1,100,"Heifer","Backgrounder Heifers",false,286.39999999999998,155.4,"Months","10 to 14",null,null,"IRONPOT","Southern Queensland",775,825,null,"No Bids"]
[8265470,817,"Lot 817",25,"Yearlings","Droughtmaster/Droughtmaster",100,"2 H",56,"Steer","Yearling Steers",false,375.1,199.2,"Months","12 to 16",null,null,"BUNGUNYA","Southern Queensland",1000,1050,1010,"Passed In","GRANT DANIEL & LONG GOONDIWINDI",-28.546399999999998,150.30699999999999,"GOONDIWINDI","QLD"]
[8265500,818,"Lot 818",12,"Yearlings","Angus/Droughtmaster",100,"3 L",42,"Steer","Yearling Steers",false,376.6,200,"Months","12 to 15",null,null,"BUNGUNYA","Southern Queensland",1000,1050,1010,"Passed In","GRANT DANIEL & LONG GOONDIWINDI",-28.546399999999998,150.30699999999999,"GOONDIWINDI","QLD"]
[8263450,819,"Lot 819",86,"Steers","Droughtmaster/Santa Gertrudis",56,1,100,"Steer","Steers",false,298.89999999999998,149.4,"Months","12 to 15",null,null,"TALWOOD","Southern Queensland",800,900,900,"Sold","OBJECTIVE LIVESTOCK MARKETING",-28.546399999999998,150.30699999999999,"GOONDIWINDI","QLD"]
[8263507,820,"Lot 820",72,"Heifers","Droughtmaster/Santa Gertrudis",69,1,100,"Heifer","Backgrounder Heifers",false,276.39999999999998,138.19999999999999,"Months","12 to 15",null,null,"TALWOOD","Southern Queensland",680,800,685,"Passed In","BARRON AGENCIES PTY LTD",-24.423300000000001,145.46299999999999,"BLACKALL","QLD"]
[8263540,821,"Lot 821",52,"Heifers","Shorthorn/Santa Gertrudis",58,1,100,"Heifer","Backgrounder Heifers",false,209.3,100.5,"Months","8 to 12",null,null,"TALWOOD","Southern Queensland",570,600,575,"Passed In","BARRON AGENCIES PTY LTD",-24.423300000000001,145.46299999999999,"BLACKALL","QLD"]
[8264449,822,"Lot 822",91,"Yearlings","Droughtmaster/Droughtmaster",38,"2 L",59,"Heifer","Yearling Heifers",false,283,147.4,"Months","8 to 14",null,null,"TALWOOD","Southern Queensland",750,790,null,"No Bids"]
[8264090,823,"Lot 823",70,"Weaners","Braford/Braford",100,"2 L",84,"Heifer","Weaned Heifers",false,247.3,102,"Months","12 to 16",null,null,"DIRRANBANDI","Southern Queensland",650,690,655,"Passed In","TOPX ST GEORGE",-28.038509300000001,148.58193600000001,"ST GEORGE","QLD"]
[8264155,824,"Lot 824",62,"Weaners","Braford/Braford",100,"2 L",97,"Heifer","Weaned Heifers",false,281,115.9,"Months","12 to 16",null,null,"DIRRANBANDI","Southern Queensland",750,785,760,"Passed In","COLIN SAY & CO.",-29.7349,151.738,"GLEN INNES","NSW"]
[8265321,825,"Lot 825",60,"Heifers","Angus/Angus",100,"3 L",55,"Heifer","Backgrounder Heifers",false,282.7,151.80000000000001,"Months","13 to 14",null,null,"DIRRANBANDI","Southern Queensland",777,791.56,782,"Passed In","RICH ENTERPRISES P/L",-26.122900000000001,149.96,"WANDOAN","QLD"]
[8265569,826,"Lot 826",60,"Heifers","Angus/Angus x Charbray",68,"3 L",74,"Heifer","Backgrounder Heifers",false,288.2,154.69999999999999,"Months","13 to 16",null,null,"DIRRANBANDI","Southern Queensland",778,792.55,783,"Passed In","OBJECTIVE LIVESTOCK MARKETING",-28.546399999999998,150.30699999999999,"GOONDIWINDI","QLD"]
[8265852,827,"Lot 827",120,"Steers","Angus/Angus",100,2,74,"Steer","Steers",false,307.5,168.3,"Months","13 to 15",null,null,"DIRRANBANDI","Southern Queensland",923,937.88,928,"Passed In","OBJECTIVE LIVESTOCK MARKETING",-28.546399999999998,150.30699999999999,"GOONDIWINDI","QLD"]
[8265879,828,"Lot 828",135,"Steers","Angus/Angus/Charolais",84,2,93,"Steer","Steers",false,311.89999999999998,170.7,"Months","13 to 16",null,null,"DIRRANBANDI","Southern Queensland",906,920.11,921,"Sold","ABARUE PTY LTD",-28.5854,148.226,"DIRRANBANDI","QLD"]
[8266417,829,"Lot 829",29,"Yearlings","Droughtmaster/Droughtmaster",48,"2 H",46,"Heifer","Feeder Heifers",false,350.2,184.3,"Months","12 to 16",null,null,"TENTERFIELD","Northern T'Land NSW",876,910.52,881,"Passed In","COLIN SAY & CO.",-29.7349,151.738,"GLEN INNES","NSW"]
[8264627,830,"Lot 830",32,"Steers","Angus/Angus",100,2,66,"Steer","Backgrounder Steers",false,309,162.6,"Months","7 to 8",null,null,"ROWENA","N.W. Slopes & Plains",840,895,915,"Sold","CL SQUIRES & CO",-29.774000000000001,151.11199999999999,"INVERELL","NSW"]
[8264635,831,"Lot 831",32,"Heifers","Angus/Angus",100,"3 L",48,"Heifer","NSM Future Breeders",false,279.2,147,"Months","7 to 8",null,null,"ROWENA","N.W. Slopes & Plains",699,754,754,"Sold","N & P JENKINS PARTNERSHIP",-30.9849,151.59299999999999,"WALCHA","NSW"]
[8265135,832,"Lot 832",77,"Weaners","Poll Hereford/Poll Hereford",92,"2 L",90,"Steer","Weaned Steers",false,241.1,118.1,"Months","6 to 7",null,null,"MUNGINDI","N.W. Slopes & Plains",720,800,800,"Sold","CL SQUIRES & CO",-29.774000000000001,151.11199999999999,"INVERELL","NSW"]
[8265160,833,"Lot 833",120,"Weaners","Poll Hereford/Poll Hereford",92,"2 L",85,"Heifer","Weaned Heifers",false,233.4,114.3,"Months","6 to 7",null,null,"MUNGINDI","N.W. Slopes & Plains",620,700,670,"Passed In","CJ & MJ ROACH",-31.3352,148.47300000000001,"GULARGAMBONE","NSW"]
[8264660,834,"Lot 834",33,"Weaners","Composite/Angus",94,1,52,"Steer","Weaned Steers",false,240.8,126.7,"Months","6 to 10",null,null,"BINGARA","N.W. Slopes & Plains",690,700,785,"Sold","CL SQUIRES & CO",-29.774000000000001,151.11199999999999,"INVERELL","NSW"]
[8264678,835,"Lot 835",29,"Weaners","Composite/Angus",86,1,69,"Heifer","Weaned Heifers",false,226,118.9,"Months","6 to 10",null,null,"BINGARA","N.W. Slopes & Plains",575,585,610,"Sold","OBJECTIVE LIVESTOCK MARKETING",-28.546399999999998,150.30699999999999,"GOONDIWINDI","QLD"]
[8265950,836,"Lot 836",42,"Steers","Droughtmaster/Shorthorn",29,2,74,"Steer","Steers",false,231.3,116.9,"Months","9 to 14",null,null,"INVERELL","N.W. Slopes & Plains",550,610,690,"Sold","CL SQUIRES & CO",-29.774000000000001,151.11199999999999,"INVERELL","NSW"]
[8265976,837,"Lot 837",27,"Heifers","Santa Gertrudis/Santa Gertrudis",44,2,85,"Heifer","Backgrounder Heifers",false,219.9,104.2,"Months","9 to 12",null,null,"INVERELL","N.W. Slopes & Plains",470,500,560,"Sold","COLIN SAY & CO.",-29.7349,151.738,"GLEN INNES","NSW"]
[8264643,838,"Lot 838",55,"Weaners","Charolais/Shorthorn Cross",100,1,96,"Steer","Weaned Steers",false,326.7,161.6,"Months","7 to 9",null,null,"BARRABA","N.W. Slopes & Plains",900,910,1085,"Sold","AM MCGREGOR & SON",-30.709499999999998,150.041,"BOGGABRI","NSW"]
[8264651,839,"Lot 839",39,"Weaners","Charolais/Shorthorn Cross",100,1,79,"Heifer","Weaned Heifers",false,300.3,148.6,"Months","7 to 9",null,null,"BARRABA","N.W. Slopes & Plains",785,795,885,"Sold","AM MCGREGOR & SON",-30.709499999999998,150.041,"BOGGABRI","NSW"]
[8266140,840,"Lot 840",76,"Weaners","Angus/Angus",100,"2 L",50,"Steer","Unweaned Steers",false,211.2,100,"Months","5 to 6",null,null,"WALCHA","Northern T'Land NSW",730,740,800,"Sold","WARRIGUL PARTNERSHIP",-29.7349,151.738,"GLEN INNES","NSW"]
[8265836,841,"Lot 841",44,"Yearlings","South Devon/Poll Hereford",36,1,66,"Steer","Feeder Steers",false,336.6,166.5,"Months","9 to 10",null,null,"BOGGABRI","N.W. Slopes & Plains",930,940,null,"No Bids"]
[8264902,842,"Lot 842",99,"Steers","Angus/Angus",100,2,71,"Steer","Backgrounder Steers",false,311.60000000000002,170.5,"Months","9 to 11",null,null,"COONABARABRAN","N.W. Slopes & Plains",925,930,1030,"Sold","CT & E CLEVERTON",-34.553699999999999,148.36500000000001,"HARDEN","NSW"]
[8264910,843,"Lot 843",96,"Heifers","Angus/Angus",100,2,84,"Heifer","NSM Future Breeders",false,284.3,149.69999999999999,"Months","9 to 11",null,null,"COONABARABRAN","N.W. Slopes & Plains",790,795,830,"Sold","AJ & KL & NJ WEISE ",-30.9849,151.59299999999999,"WALCHA","NSW"]
[8265984,844,"Lot 844",55,"Vealers","Charolais/Angus",29,"2 L",62,"Heifer","Heifer Vealers",false,209.6,108.1,"Months","5 to 9",null,null,"NYNGAN","Central Western NSW",570,640,575,"Passed In","SPENCER & BENNETT, YENDA PRODS",-34.288499999999999,146.05099999999999,"GRIFFITH","NSW"]
[8266123,845,"Lot 845",37,"Vealers","Angus/Angus/Charolais",35,"2 L",78,"Steer","Steer Vealers",false,218.5,112.6,"Months","5 to 9",null,null,"NYNGAN","Central Western NSW",700,735,null,"No Bids"]
[8265992,846,"Lot 846",15,"Weaners","Santa Gertrudis/Santa Gertrudis",80,1,80,"Steer","Weaned Steers",false,280.7,153.6,"Months","8 to 10",null,null,"GLOUCESTER","North Coast NSW",700,800,740,"Passed In","FIRST NATIONAL GLOUCESTER",-32.0077,151.96299999999999,"GLOUCESTER","NSW"]
[8266085,847,"Lot 847",24,"Weaners","Santa Gertrudis/Santa Gertrudis",62,1,79,"Steer","Weaned Steers",false,231,126.4,"Months","8 to 10",null,null,"GLOUCESTER","North Coast NSW",600,700,700,"Sold","DAVIDSON CAMERON CLYDSDALE TAYLOR & CO"]
[8266131,848,"Lot 848",19,"Weaners","Santa Gertrudis/Santa Gertrudis",89,1,57,"Heifer","Weaned Heifers",false,248.1,135.80000000000001,"Months","8 to 10",null,null,"GLOUCESTER","North Coast NSW",600,700,660,"Passed In","DEBARRY PARTNERSHIP",-31.2818,152.685,"ROLLANDS PLAINS","NSW"]
[8266158,849,"Lot 849",21,"Weaners","Charolais/Santa Cross",81,1,76,"Heifer","Weaned Heifers",false,229.9,125.8,"Months","8 to 10",null,null,"GLOUCESTER","North Coast NSW",580,660,660,"Sold","DAVIDSON CAMERON CLYDSDALE TAYLOR & CO"]
[8266093,850,"Lot 850",30,"Weaners","Angus/Angus",100,1,66,"Heifer","Weaned Heifers",false,211.6,115.8,"Months","6 to 8",null,null,"SCONE","Hunter NSW",600,635,655,"Sold","N & P JENKINS PARTNERSHIP",-30.9849,151.59299999999999,"WALCHA","NSW"]
[8266115,851,"Lot 851",30,"Weaners","Angus/Angus",100,1,100,"Steer","Weaned Steers",false,223.7,122.5,"Months","6 to 8",null,null,"SCONE","Hunter NSW",750,780,805,"Sold","JIM HINDMARSH & SON",-34.553699999999999,150.37100000000001,"MOSS VALE","NSW"]
[8265127,852,"Lot 852",49,"Weaners","Shorthorn/Shorthorn",100,1,100,"Heifer","Weaned Heifers",false,158.6,85.9,"Months","5 to 6",null,null,"MERRIWA","Hunter NSW",440,475,530,"Sold","MD PRATTEN",-33.2485,148.96799999999999,"BORENORE","NSW"]
[8265151,853,"Lot 853",63,"Weaners","Shorthorn/Shorthorn",100,1,100,"Steer","Weaned Steers",false,203.8,110.4,"Months","5 to 7",null,null,"MERRIWA","Hunter NSW",675,710,760,"Sold","MR AND CL AITKEN",-33.613500000000002,148.43600000000001,"GOOLOOGONG","NSW"]
[8265178,854,"Lot 854",62,"Weaners","Shorthorn/Shorthorn",100,1,100,"Steer","Weaned Steers",false,203.7,110.4,"Months","5 to 7",null,null,"MERRIWA","Hunter NSW",675,710,760,"Sold","MR AND CL AITKEN",-33.613500000000002,148.43600000000001,"GOOLOOGONG","NSW"]
[8265259,855,"Lot 855",37,"Weaners","Angus/Angus",54,"2 L",67,"Steer","Unweaned Steers",false,199.5,105,"Months","5 to 6",null,null,"RYLSTONE","Central Western NSW",550,570,630,"Sold","CL SQUIRES & CO",-29.774000000000001,151.11199999999999,"INVERELL","NSW"]
[8265275,856,"Lot 856",36,"Weaners","Angus/Murray Grey",50,"2 L",55,"Heifer","Unweaned Heifers",false,191.4,100.7,"Months","5 to 6",null,null,"RYLSTONE","Central Western NSW",480,500,545,"Sold","GJ HULM & CO PTY LTD",-35.125799999999998,147.35400000000001,"WAGGA WAGGA","NSW"]
[8265429,857,"Lot 857",54,"Yearlings","Angus/Composite",100,1,100,"Heifer","Feeder Heifers",false,343.2,180.6,"Months","17 to 18",null,null,"ORANGE","Central Western NSW",875,925,890,"Passed In","ELDERS KILLARA FEEDLOT",-31.5076,150.679,"QUIRINDI","NSW"]
[8265577,858,"Lot 858",21,"Yearlings","Composite/Composite",67,1,100,"Heifer","Feeder Heifers",false,334.6,176.1,"Months","17 to 18",null,null,"ORANGE","Central Western NSW",850,890,855,"Passed In","ELDERS KILLARA FEEDLOT",-31.5076,150.679,"QUIRINDI","NSW"]
[8265194,859,"Lot 859",72,"Yearlings","Angus/Angus",100,1,47,"Heifer","Feeder Heifers",false,355.4,187.1,"Months","17 to 18",null,null,"BLAYNEY","Central Western NSW",905,955,930,"Passed In","ELDERS KILLARA FEEDLOT",-31.5076,150.679,"QUIRINDI","NSW"]
[8265208,860,"Lot 860",40,"Yearlings","Angus/Hereford",75,"2 L",59,"Heifer","Feeder Heifers",false,374.3,197,"Months","17 to 18",null,null,"BLAYNEY","Central Western NSW",950,970,null,"No Bids"]
[8265585,861,"Lot 861",38,"Weaners","Angus/Angus",100,"2 L",69,"Steer","Weaned Steers",false,207,100.2,"Months","8 to 9",null,null,"BATHURST","Central Western NSW",650,750,810,"Sold","CAROLYN JANE THORBURN",-33.572499999999998,149.98699999999999,"SODWALLS","NSW"]
[8265658,862,"Lot 862",29,"Weaners","Angus/Angus",100,"2 L",66,"Heifer","Weaned Heifers",false,201.7,97.7,"Months","8 to 9",null,null,"BATHURST","Central Western NSW",500,600,670,"Sold","MASTERS STEPHENS BATHURST",-33.417400000000001,149.58099999999999,"BATHURST","NSW"]
[8266379,863,"Lot 863",35,"Yearlings","Angus/Angus",100,"2 H",66,"Heifer","NSM Future Breeders",false,354.5,194.1,"Months","16 to 18",null,null,"OBERON","Central Western NSW",860,880,885,"Sold","RAY WHITE EMMS MOONEY P/L",-33.529499999999999,149.25,"BLAYNEY","NSW"]
[8265100,864,"Lot 864",30,"Weaners","Angus/Angus",100,1,100,"Steer","Unweaned Steers",false,280.7,152.1,"Months","5 to 7",null,null,"MOSS VALE","Southern Tablelands",880,900,905,"Sold","JIM HINDMARSH & SON",-34.553699999999999,150.37100000000001,"MOSS VALE","NSW"]
[8265755,865,"Lot 865",30,"Weaners","Angus/Angus",100,1,100,"Heifer","Weaned Heifers",false,200.7,103.5,"Months","5 to 6",null,null,"BRAIDWOOD","Southern Tablelands",590,600,670,"Sold","ELDERS DORRIGO",-30.341100000000001,152.714,"DORRIGO","NSW"]
[8265763,866,"Lot 866",28,"Weaners","Angus/Angus",100,1,100,"Heifer","Weaned Heifers",false,176.3,90.9,"Months","5 to 6",null,null,"BRAIDWOOD","Southern Tablelands",515,530,555,"Sold","ELDERS DORRIGO",-30.341100000000001,152.714,"DORRIGO","NSW"]
[8264945,867,"Lot 867",44,"Weaners","Angus/Angus",95,"2 L",55,"Mixed Sex","Unweaned Mixed Sexes",false,214.8,111.7,"Months","6 to 7",null,null,"BOOK BOOK","Riverina NSW",690,700,695,"Passed In","LANDMARK EAST GIPPSLAND LVSTK",-37.824599999999997,147.63200000000001,"BAIRNSDALE","VIC"]
[8265313,868,"Lot 868",75,"Weaners","Angus/Angus",100,"2 L",76,"Steer","Weaned Steers",false,282.3,142.69999999999999,"Months","9 to 10",null,null,"CREIGHTONS CREEK","Northern Victoria",800,930,880,"Passed In","ELDERS GUNDAGAI",-35.065199999999997,148.108,"GUNDAGAI","NSW"]
[8265224,869,"Lot 869",46,"Weaners","Angus/Angus",100,"2 H",45,"Steer","Weaned Steers",false,401.7,211.4,"Months","10 to 11",null,null,"JABUK","Riverland & Mallee S.A.",1134.8499999999999,1144.8499999999999,1144.8499999999999,"Sold","PRINCESS ROYAL STATION",-33.671700000000001,138.928,"BURRA","SA"]
[8265232,870,"Lot 870",26,"Weaners","Angus/Angus",100,"2 H",58,"Heifer","Weaned Heifers",false,384.4,194.2,"Months","9 to 11",null,null,"JABUK","Riverland & Mallee S.A.",989.44,999.44,1069.44,"Sold","THOMAS, DE GARIS & CLARKSON",-37.3752,140.83699999999999,"PENOLA","SA"]
[8265240,871,"Lot 871",21,"Weaners","Angus/Angus",100,"2 L",46,"Heifer","Weaned Heifers",false,331.7,167.6,"Months","8 to 10",null,null,"JABUK","Riverland & Mallee S.A.",852.42,862.42,912.42,"Sold","LANDMARK STRATHALBYN",-35.259799999999998,138.892,"STRATHALBYN","SA"]
[8265356,872,"Lot 872",22,"Weaners","Angus/Angus",73,1,77,"Steer","Weaned Steers",false,342.2,183.7,"Months","9 to 12",null,null,"CHARLESTON","Central & Hills S.A.",890,950,895,"Passed In","SCHUBERT BOERS",-36.0749,146.92400000000001,"ALBURY","NSW"]
[8265372,873,"Lot 873",19,"Weaners","Angus/Angus",89,1,95,"Steer","Weaned Steers",false,287.89999999999998,151.5,"Months","9 to 11",null,null,"CHARLESTON","Central & Hills S.A.",780,825,790,"Passed In","SCHUBERT BOERS",-36.0749,146.92400000000001,"ALBURY","NSW"]
[8265593,874,"Lot 874",51,"Heifers","Angus/Angus",100,2,78,"Heifer","Backgrounder Heifers",false,362.2,175.4,"Months","13 to 20",null,null,"CANOWIE","Mid & Upper North S.A.",868.61,923.61,883.61,"Passed In","LANDMARK JAMESTOWN",-33.205300000000001,138.60499999999999,"JAMESTOWN","SA"]
[8264813,875,"Lot 875",32,"Weaners","South Devon/South Devon",100,1,85,"Steer","Weaned Steers",false,250.1,134.1,"Months","9 to 11",null,null,"WIRRABARA","Mid & Upper North S.A.",650,700,655,"Passed In","SCHUBERT BOERS",-36.0749,146.92400000000001,"ALBURY","NSW"]
[8265364,200,"Lot 200",94,"Heifers","Santa Gertrudis/Santa Gertrudis",87,1,77,"Heifer","Backgrounder Heifers",false,305.7,152.80000000000001,"Months","16 to 20",null,null,"QUILPIE","Western Queensland",855,885,870,"Sold","SMITHFIELD CATTLE COMPANY PTY LTD",-26.160699999999999,151.6,"PROSTON","QLD"]
[8265399,201,"Lot 201",128,"Yearlings","Santa Gertrudis/Santa Gertrudis",82,1,79,"Heifer","Backgrounder Heifers",false,268.60000000000002,134.30000000000001,"Months","14 to 18",null,null,"QUILPIE","Western Queensland",750,780,780,"Sold","PURTLE PLEVEY AGENCIES",-30.747499999999999,150.72,"MANILLA","NSW"]
[8265437,202,"Lot 202",101,"Yearlings","Santa Gertrudis/Santa Gertrudis",92,1,100,"Heifer","Backgrounder Heifers",false,212.4,106.2,"Months","12 to 16",null,null,"QUILPIE","Western Queensland",585,615,615,"Sold","PURTLE PLEVEY AGENCIES",-30.747499999999999,150.72,"MANILLA","NSW"]
[8265453,203,"Lot 203",56,"Heifers","Composite/Brahman",32,2,72,"Heifer","Feeder Heifers",false,349.9,182,"Months","16 to 24",null,null,"QUILPIE","Western Queensland",915,945,null,"No Bids"]
[8265488,204,"Lot 204",105,"Heifers","Brahman/Brahman",26,1,56,"Heifer","Backgrounder Heifers",false,273.2,136.6,"Months","16 to 20",null,null,"QUILPIE","Western Queensland",705,735,null,"No Bids"]
[8265518,205,"Lot 205",122,"Yearlings","Brahman/Brahman",35,1,100,"Heifer","Backgrounder Heifers",false,215.1,103.2,"Months","12 to 16",null,null,"QUILPIE","Western Queensland",595,625,600,"Sold","ELDERS CUNNAMULLA",-28.067699999999999,145.684,"CUNNAMULLA","QLD"]
[8265615,206,"Lot 206",35,"Cows & Calves","Santa Gertrudis/Santa Gertrudis",69,1,94,"Cow","Cows & Calves",false,400.3,172.1,"Years","3 to 8",null,null,"QUILPIE","Western Queensland",1120,1200,1300,"Sold","YARRAWONGA CATTLE CO",-26.582699999999999,149.18700000000001,"WALLUMBILLA","QLD"]
[8265550,207,"Lot 207",34,"Cows & Calves","Santa Gertrudis/Santa Gertrudis",59,1,88,"Cow","Cows & Calves",false,409,175.9,"Years","3 to 8",null,null,"QUILPIE","Western Queensland",1120,1200,1220,"Sold","YARRAWONGA CATTLE CO",-26.582699999999999,149.18700000000001,"WALLUMBILLA","QLD"]
[8265682,208,"Lot 208",36,"Cows & Calves","Santa Gertrudis/Santa Gertrudis",89,1,91,"Cow","Cows & Calves",false,424,182.3,"Years","3 to 8",null,null,"QUILPIE","Western Queensland",1120,1200,1250,"Sold","YARRAWONGA CATTLE CO",-26.582699999999999,149.18700000000001,"WALLUMBILLA","QLD"]
[8266050,209,"Lot 209",94,"Cows","Santa Gertrudis/Santa Gertrudis",85,2,43,"Cow","PTIC Cows",false,465.3,209.4,"Years","3 to 7",null,null,"QUILPIE","Western Queensland",900,950,950,"Sold","ALLIED BEEF",-27.560600000000001,151.95400000000001,"TOOWOOMBA","QLD"]
[8266166,210,"Lot 210",56,"Cows","Santa Gertrudis/Santa Gertrudis",79,1,52,"Cow","PTIC Cows",false,407.6,183.4,"Years","2 to 9",null,null,"QUILPIE","Western Queensland",850,900,860,"Sold","ALLIED BEEF",-27.560600000000001,151.95400000000001,"TOOWOOMBA","QLD"]
[8266174,211,"Lot 211",99,"Cows & Calves","Droughtmaster/Droughtmaster",72,1,97,"Cow","Station Mated Heifers & Calves",false,360.1,151.19999999999999,"Months","18 to 36",null,null,"BARCALDINE","Western Queensland",945,995,1240,"Sold","HOCH & WILKINSON",-22.824100000000001,147.636,"CLERMONT","QLD"]
[8265186,212,"Lot 212",80,"Cows & Calves","Santa Gertrudis/Santa Cross",19,1,100,"Cow","Cows & Calves",false,385.2,186.5,"Years","2 to 7",null,null,"ISISFORD","Western Queensland",1080,1125,1210,"Sold","MW&PH JOHNSON",-26.582699999999999,149.18700000000001,"WALLUMBILLA","QLD"]
[8265216,213,"Lot 213",80,"Cows & Calves","Santa Gertrudis/Brahman Cross",31,1,100,"Cow","Station Mated Cows & Calves",false,378,183,"Years","2 to 8",null,null,"ISISFORD","Western Queensland",1080,1125,1200,"Sold","LANDMARK WANDOAN",-26.122900000000001,149.96,"WANDOAN","QLD"]
[8266042,214,"Lot 214",1,"Bulls","Wagyu/Wagyu",100,1,100,"Bull","Wagyu Fullblood 100% Bull",false,427.5,216,"Months","32 to 32",null,null,"BARALABA","Central Queensland",1950,2000,null,"No Bids"]
[8266069,215,"Lot 215",1,"Bulls","Wagyu/Wagyu",100,1,100,"Bull","Wagyu Fullblood 100% Bull",false,503.5,254.4,"Months","28 to 28",null,null,"BARALABA","Central Queensland",1950,2000,null,"No Bids"]
[8266280,216,"Lot 216",112,"Steers","Droughtmaster/Droughtmaster Cross",36,2,92,"Steer","Steers",false,381.3,194.4,"Months","20 to 26",null,null,"MUNGALLALA","Southern Queensland",1230,1300,1240,"Passed In","LANDMARK MITCHELL",-26.4858434,147.9792904,"MITCHELL","QLD"]
[8264619,217,"Lot 217",93,"Heifers","Santa Gertrudis/Santa Gertrudis",61,2,57,"Heifer","NSM Future Breeders",false,368.5,188,"Months","14 to 16",null,null,"MITCHELL","Southern Queensland",939.95,994.95,944.95,"Passed In","MAA L'STOCK & PROPERTY MITCHELL",-26.4858434,147.9792904,"MITCHELL","QLD"]
[8266026,218,"Lot 218",33,"Steers","Murray Grey/Murray Grey",79,2,100,"Steer","Feeder Steers",false,320.10000000000002,168.5,"Months","14 to 16",null,null,"MITCHELL","Southern Queensland",942.31,992.31,947.31,"Passed In","MAA L'STOCK & PROPERTY MITCHELL",-26.4858434,147.9792904,"MITCHELL","QLD"]
[8266107,219,"Lot 219",76,"Yearlings","Droughtmaster/Hereford Cross",34,"2 L",84,"Heifer","Backgrounder Heifers",false,276.39999999999998,136.80000000000001,"Months","11 to 20",null,null,"MITCHELL","Southern Queensland",630,750,640,"Passed In","MH & KT KILLEN",-26.4858434,147.9792904,"MITCHELL","QLD"]
[8265623,220,"Lot 220",49,"Cows & Calves","Angus/Angus",100,2,68,"Cow","Cows & Calves",true,516.79999999999995,250.2,"Years","5 to 5",null,null,"TARA","Southern Queensland",2100,2300,2190,"Passed In","ELDERS TOOWOOMBA",-27.560600000000001,151.95400000000001,"TOOWOOMBA","QLD"]
[8265704,221,"Lot 221",29,"Cows & Calves","Angus/Angus",100,2,80,"Cow","Cows & Calves",true,528,255.7,"Years","5 to 5",null,null,"TARA","Southern Queensland",2100,2300,2210,"Passed In","CALLOW LIVESTOCK",-32.016300000000001,149.387,"DUNEDOO","NSW"]
[8262683,222,"Lot 222",19,"Cows & Calves","Angus/Angus",100,2,52,"Cow","Cows & Calves",false,503.8,257.2,"Years","7 to 9",null,null,"CLIFTON","Southern Queensland",1400,1500,1570,"Sold","JENFIELD PTY LTD",-28.6572,151.934,"STANTHORPE","QLD"]
[8264805,223,"Lot 223",6,"Cows & Calves","Hereford/Hereford",50,2,75,"Cow","Cows & Calves",false,495.1,252.8,"Years","7 to 9",null,null,"CLIFTON","Southern Queensland",1300,1400,1500,"Sold","JENFIELD PTY LTD",-28.6572,151.934,"STANTHORPE","QLD"]
[8262004,224,"Lot 224",6,"Cows","Charbray/Charbray",100,2,49,"Cow","PTIC Cows",false,745.8,331.5,"Months","60 to 171",null,null,"ST GEORGE","Southern Queensland",1600,1800,null,"No Bids"]
[8262136,225,"Lot 225",22,"Cows & Calves","Charbray/Charbray",100,"3 L",37,"Cow","Cows & Calves",false,583,259.10000000000002,"Months","52 to 109",null,null,"ST GEORGE","Southern Queensland",1800,2000,1810,"Passed In","EJ Gorkow & TT Horrocks",-26.122900000000001,149.96,"WANDOAN","QLD"]
[8264600,226,"Lot 226",63,"Cows","Angus/Angus",100,"3 H",23,"Cow","PTIC Cows",false,610.29999999999995,308.3,"Years","2 to 5",null,null,"ROWENA","N.W. Slopes & Plains",1490,1600,1600,"Sold","ELDERS HOLBROOK",-35.721899999999998,147.31399999999999,"HOLBROOK","NSW"]
[8264767,227,"Lot 227",42,"Cows","Angus/Angus",100,"3 L",26,"Cow","PTIC Cows",false,610.29999999999995,308.39999999999998,"Years","2 to 5",null,null,"ROWENA","N.W. Slopes & Plains",1490,1600,1600,"Sold","MALINYOOK GRAIN P/L",-33.425199999999997,146.727,"TULLIBIGEAL","NSW"]
[8264406,228,"Lot 228",17,"Cows & Calves","Angus/Angus Cross",47,2,46,"Cow","NSM Cows & Calves",false,509.5,252,"Years","7 to 9",null,null,"PILLIGA","N.W. Slopes & Plains",1300,1400,null,"No Bids"]
[8266018,229,"Lot 229",15,"Cows & Calves","Santa Gertrudis/Hereford",47,"3 L",33,"Cow","Station Mated Cows & Calves",false,530,254.4,"Years","3 to 12",null,null,"GURLEY","N.W. Slopes & Plains",1200,1300,1380,"Sold","RF KENT & JL SMITH",-30.607600000000001,148.971,"GWABEGAR","NSW"]
[8265941,230,"Lot 230",25,"Cows & Calves","Shorthorn/Shorthorn",88,2,64,"Cow","Station Mated Cows & Calves",false,502,235.6,"Years","3 to 8",null,null,"PALLAMALLAWA","N.W. Slopes & Plains",1350,1450,1355,"Passed In","WILLIAMS STOCK & PROPERTY",-29.462800000000001,149.84200000000001,"MOREE","NSW"]
[8265402,231,"Lot 231",29,"Cows","Angus/Angus",100,2,60,"Cow","PTIC Cows",false,545.9,247.6,"Months","105 to 141",null,null,"COOLATAI","N.W. Slopes & Plains",900,950,null,"No Bids"]
[8264856,232,"Lot 232",58,"Cows","Angus/Angus",100,2,47,"Cow","PTIC Cows",false,513.29999999999995,232.8,"Months","31 to 93",null,null,"COOLATAI","N.W. Slopes & Plains",900,1000,1150,"Sold","JUANDAH GRAZING PTY LTD",-26.257000000000001,150.04400000000001,"GULUGUBA","QLD"]
[8265445,233,"Lot 233",46,"Cows","Angus/Angus",100,2,66,"Cow","Cows",false,506.3,229.7,"Months","31 to 129",null,null,"COOLATAI","N.W. Slopes & Plains",800,820,895,"Sold","SMITHFIELD CATTLE COMPANY PTY LTD",-26.160699999999999,151.6,"PROSTON","QLD"]
[8265054,234,"Lot 234",72,"Cows","Brangus/Brangus",47,2,87,"Cow","PTIC Cows",false,510.7,242.2,"Years","2 to 12",null,null,"WARIALDA","N.W. Slopes & Plains",1200,1300,1240,"Passed In","FRAME RURAL AGENCIES",-29.774000000000001,151.11199999999999,"INVERELL","NSW"]
[8262969,235,"Lot 235",23,"Heifers","Angus/Angus",100,"3 L",53,"Heifer","PTIC Heifers",false,446.3,246.4,"Months","16 to 17",null,null,"BINGARA","N.W. Slopes & Plains",1250,1400,1820,"Sold","ELDERS GUNNEDAH",-30.980699999999999,150.25800000000001,"GUNNEDAH","NSW"]
[8262977,236,"Lot 236",22,"Heifers","Angus/Angus",100,"3 L",50,"Heifer","PTIC Heifers",false,446.2,246.3,"Months","16 to 17",null,null,"BINGARA","N.W. Slopes & Plains",1250,1400,1730,"Sold","ELDERS GUNNEDAH",-30.980699999999999,150.25800000000001,"GUNNEDAH","NSW"]
[8264724,237,"Lot 237",46,"Heifers","Angus/Angus",100,"3 L",50,"Heifer","NSM Future Breeders",false,457,235.6,"Months","15 to 18",null,null,"BUNDARRA","Northern T'Land NSW",1200,1300,null,"No Bids"]
[8266190,238,"Lot 238",31,"Cows & Calves","Charolais/Charolais",100,2,100,"Cow","Station Mated Cows & Calves",false,583.5,270.3,"Years","5 to 9",null,null,"BUNDARRA","Northern T'Land NSW",1550,1600,1690,"Sold","Cinibar Pastoral Company Pty Ltd",-29.9818,150.768,"KEERA","NSW"]
[8265712,239,"Lot 239",58,"Cows & Calves","Santa Gertrudis/Santa Gertrudis",43,1,91,"Cow","Cows & Calves",false,362.4,152.6,"Years","3 to 3.5",null,null,"INVERELL","N.W. Slopes & Plains",1050,1095,1450,"Sold","ID&R RADFORD",-28.903400000000001,150.77799999999999,"YETMAN","NSW"]
[8265860,240,"Lot 240",28,"Steers","Angus/Angus",36,2,59,"Steer","Feeder Steers",false,412.1,225.6,"Months","22 to 28",null,null,"INVERELL","N.W. Slopes & Plains",1050,1090,1105,"Sold","RAY WHITE RURAL TENTERFIELD",-29.049499999999998,152.02000000000001,"TENTERFIELD","NSW"]
[8265917,241,"Lot 241",24,"Heifers","Angus/Santa/Angus",50,"4 L",58,"Heifer","Heifers",false,417.6,233,"Months","22 to 28",null,null,"INVERELL","N.W. Slopes & Plains",980,1035,1060,"Sold","RAY WHITE RURAL CASINO ",-28.8582,153.047,"CASINO","NSW"]
[8265097,242,"Lot 242",13,"Cows","Hereford/Hereford",100,2,68,"Cow","PTIC Cows",false,505,242,"Years","3 to 7",null,null,"GLEN INNES","Northern T'Land NSW",1100,1200,1125,"Passed In","COLIN SAY & CO.",-29.7349,151.738,"GLEN INNES","NSW"]
[8260567,243,"Lot 243",20,"Cows","Shorthorn/Shorthorn",60,"4 L",55,"Cow","PTIC Cows",false,579.29999999999995,268.3,"Years","3.5 to 4.5",null,null,"GUYRA","Northern T'Land NSW",1200,1350,null,"No Bids"]
[8262470,244,"Lot 244",50,"Heifers","Angus/Angus",100,2,82,"Heifer","Station Mated Heifers",true,329.3,149,"Months","14 to 16",null,null,"WALCHA","Northern T'Land NSW",850,900,null,"No Bids"]
[8264430,245,"Lot 245",19,"Steers","Charolais/Angus",58,2,100,"Steer","Steers",false,311.89999999999998,151,"Months","13 to 14",null,null,"WALCHA","Northern T'Land NSW",850,870,null,"No Bids"]
[8266239,246,"Lot 246",22,"Heifers","Angus/Angus/Hereford",100,"3 H",59,"Heifer","PTIC Heifers",false,423.1,224.5,"Months","18 to 20",null,null,"WALCHA","Northern T'Land NSW",1100,1200,null,"No Bids"]
[8266255,247,"Lot 247",50,"Heifers","Angus/Angus",100,"3 L",36,"Heifer","PTIC Heifers",false,412,218.6,"Months","18 to 20",null,null,"WALCHA","Northern T'Land NSW",1200,1300,1300,"Sold","JA MCGREGOR LIVESTOCK & PROPERTY",-29.543500000000002,150.57499999999999,"WARIALDA","NSW"]
[8266271,248,"Lot 248",49,"Heifers","Angus/Angus",100,"3 L",40,"Heifer","PTIC Heifers",false,409.9,217.5,"Months","18 to 20",null,null,"WALCHA","Northern T'Land NSW",1200,1300,1290,"Passed In","HART RURAL AGENCIES",-30.3855,150.60900000000001,"BARRABA","NSW"]
[8265780,249,"Lot 249",22,"Cows","Shorthorn/Hereford",100,2,51,"Cow","PTIC Cows",false,552.1,244.7,"Years","5 to 8",null,null,"MANILLA","N.W. Slopes & Plains",840,850,965,"Sold","PROFITABLE CATTLE",-37.884799999999998,145.005,"ELSTERNWICK","VIC"]
[8265810,250,"Lot 250",3,"Cows & Calves","Shorthorn/Shorthorn/Hereford",100,1,67,"Cow","Station Mated Cows & Calves",false,562.70000000000005,239.5,"Years","6 to 7",null,null,"MANILLA","N.W. Slopes & Plains",880,890,1135,"Sold","T & D MCCUMSTIE FAMILY PARTNERSHIP",-30.980699999999999,150.25800000000001,"GUNNEDAH","NSW"]
[8266034,251,"Lot 251",24,"Cows","Angus/Angus",96,2,51,"Cow","PTIC Cows",false,452,216.6,"Years","2.5 to 2.5",null,null,"MANILLA","N.W. Slopes & Plains",990,1000,1050,"Sold","HART RURAL AGENCIES",-30.3855,150.60900000000001,"BARRABA","NSW"]
[8266409,252,"Lot 252",74,"Cows","Hereford/Hereford",89,1,74,"Cow","NSM Cows",false,420.9,189.4,"Years","5 to 7",null,null,"MURRURUNDI","Hunter NSW",720,750,null,"No Bids"]
[8265909,253,"Lot 253",6,"Cows & Calves","Hereford/Hereford",33,2,66,"Cow","PTIC Cows & Calves",false,444.1,187,"Years","8 to 10",null,null,"GLOUCESTER","North Coast NSW",950,1020,1070,"Sold","Lewis Ecological Surveys pty ltd",-29.638300000000001,152.929,"JUNCTION HILL","NSW"]
[8263574,254,"Lot 254",15,"Yearlings","Angus/Angus",100,"2 L",100,"Steer","Yearling Steers",false,359.3,189.1,"Months","10 to 14",null,null,"DUNGOG","Hunter NSW",980,1050,null,"No Bids"]
[8263604,255,"Lot 255",19,"Yearlings","Angus/Angus",100,1,95,"Steer","Yearling Steers",false,276.8,139.80000000000001,"Months","10 to 14",null,null,"DUNGOG","Hunter NSW",880,900,null,"No Bids"]
[8263647,256,"Lot 256",22,"Yearlings","Angus/Angus",100,1,86,"Heifer","NSM Yearling Heifers",false,267.10000000000002,135,"Months","10 to 14",null,null,"DUNGOG","Hunter NSW",780,800,785,"Sold","ELDERS GOULBURN",-34.751600000000003,149.721,"GOULBURN","NSW"]
[8263701,257,"Lot 257",36,"Cows","Shorthorn/Shorthorn",94,2,59,"Cow","PTIC Cows",false,489.8,247.5,"Years","5 to 9",null,null,"MERRIWA","Hunter NSW",850,855,855,"Sold","ELDERS ALBURY",-36.0749,146.92400000000001,"ALBURY","NSW"]
[8265461,258,"Lot 258",47,"Cows","Angus/Angus",100,2,42,"Cow","PTIC Cows",false,554.4,285.8,"Years","3.5 to 4.5",null,null,"COOLAH","Central Western NSW",1270,1300,1725,"Sold","D & P BONDFIELD",-28.4895,151.971,"DALVEEN","QLD"]
[8265534,259,"Lot 259",47,"Cows","Angus/Angus",100,2,42,"Cow","PTIC Cows",false,554.4,285.8,"Years","3.5 to 4.5",null,null,"COOLAH","Central Western NSW",1270,1300,1725,"Sold","D & P BONDFIELD",-28.4895,151.971,"DALVEEN","QLD"]
[8265542,260,"Lot 260",42,"Heifers","Angus/Angus",100,"3 H",46,"Heifer","PTIC Heifers",false,567.5,304.60000000000002,"Months","28 to 32",null,null,"COOLAH","Central Western NSW",1470,1500,1805,"Sold","ELDERS HOLBROOK",-35.721899999999998,147.31399999999999,"HOLBROOK","NSW"]
[8265607,261,"Lot 261",70,"Heifers","Angus/Angus",100,2,74,"Heifer","PTIC Heifers",false,508.9,262.3,"Months","28 to 32",null,null,"COOLAH","Central Western NSW",1320,1350,1505,"Sold","MILLING STUART PTY LTD",-32.016300000000001,149.387,"DUNEDOO","NSW"]
[8265631,262,"Lot 262",70,"Heifers","Angus/Angus",100,2,74,"Heifer","PTIC Heifers",false,508.9,262.3,"Months","28 to 32",null,null,"COOLAH","Central Western NSW",1320,1350,1515,"Sold","MILLING STUART PTY LTD",-32.016300000000001,149.387,"DUNEDOO","NSW"]
[8265640,263,"Lot 263",70,"Heifers","Angus/Angus",100,2,74,"Heifer","PTIC Heifers",false,508.9,262.3,"Months","28 to 32",null,null,"COOLAH","Central Western NSW",1320,1350,1500,"Sold","DAVIDSON CAMERON MCCULLOCH & C",-31.090499999999999,150.929,"TAMWORTH","NSW"]
[8264511,264,"Lot 264",25,"Heifers","Angus/Angus",84,2,68,"Heifer","PTIC Heifers",false,413.4,217.6,"Months","23 to 25",null,null,"TRANGIE","Central Western NSW",1300,1500,1320,"Passed In","TRANGIE LIVESTOCK & PROPERTY",-32.031500000000001,147.983,"TRANGIE","NSW"]
[8265267,265,"Lot 265",34,"Cows & Calves","Poll Hereford/Hereford",85,"4 L",40,"Cow","NSM Cows & Calves",false,625.5,296.3,"Years","3 to 8",null,null,"DUNEDOO","Central Western NSW",1330,1400,1440,"Sold","STRATHDOON PASTORAL",-34.532899999999998,148.23500000000001,"NUBBA","NSW"]
[8265283,266,"Lot 266",36,"Cows & Calves","Poll Hereford/Hereford",100,2,82,"Cow","NSM Heifers & Calves",false,410.6,185.8,"Years","2.5 to 3.5",null,null,"DUNEDOO","Central Western NSW",1230,1300,1350,"Sold","PATTISON LIVESTOCK P/L",-35.125799999999998,147.35400000000001,"WAGGA WAGGA","NSW"]
[8263515,267,"Lot 267",36,"Cows & Calves","Angus/Angus",81,2,97,"Cow","Cows & Calves",false,439.8,206.2,"Years","2 to 11",null,null,"GULGONG","Central Western NSW",1375,1425,1435,"Sold","FORBES LIVESTOCK AGENCY CO P/L",-33.384399999999999,148.00800000000001,"FORBES","NSW"]
[8264953,268,"Lot 268",30,"Cows","Shorthorn/Shorthorn",83,"3 L",67,"Cow","PTIC Cows",false,613.9,284.3,"Years","6 to 6",null,null,"CUMNOCK","Central Western NSW",1300,1350,1325,"Passed In","LANDMARK WILSON RUSS",-31.702200000000001,147.834,"WARREN","NSW"]
[8265143,269,"Lot 269",62,"Cows","Angus/Angus",100,2,64,"Cow","PTIC Cows",false,543,262.89999999999998,"Years","6.5 to 6.5",null,null,"BATHURST","Central Western NSW",1400,1500,1405,"Passed In","ELDERS GUNNEDAH",-30.980699999999999,150.25800000000001,"GUNNEDAH","NSW"]
[8260958,270,"Lot 270",40,"Heifers","Angus/Angus",100,2,44,"Heifer","PTIC Heifers",false,482.1,238.5,"Months","15 to 16",null,null,"COWRA","Central Western NSW",1500,1600,1625,"Sold","MCCARRON CULLINANE",-33.283099999999997,149.1,"ORANGE","NSW"]
[8263272,271,"Lot 271",6,"Cows & Calves","Angus/Angus",100,"3 H",100,"Cow","NSM Cows & Calves",false,491.5,240.7,"Months","16 to 96",null,null,"YOUNG","SW Slopes & Plains",1550,1600,1555,"Passed In","GERRARD & PARTNERS LIVESTOCK & PROPERTY",-34.313499999999998,148.30099999999999,"YOUNG","NSW"]
[8264716,272,"Lot 272",47,"Cows","Shorthorn/Angus/Shorthorn",30,"4 L",65,"Cow","PTIC Cows",false,611.29999999999995,299.39999999999998,"Years","2 to 5",null,null,"YOUNG","SW Slopes & Plains",1350,1400,1355,"Passed In","GERRARD & PARTNERS LIVESTOCK & PROPERTY",-34.313499999999998,148.30099999999999,"YOUNG","NSW"]
[8264783,273,"Lot 273",54,"Cows","Shorthorn/Angus/Shorthorn",30,"4 H",43,"Cow","PTIC Cows",false,680.9,333.5,"Years","6 to 10",null,null,"YOUNG","SW Slopes & Plains",1250,1300,1255,"Passed In","GERRARD & PARTNERS LIVESTOCK & PROPERTY",-34.313499999999998,148.30099999999999,"YOUNG","NSW"]
[8265801,274,"Lot 274",19,"Cows","Angus/Angus",100,"4 H",64,"Cow","PTIC Cows",false,611.5,299.5,"Years","2 to 5",null,null,"HARDEN","SW Slopes & Plains",1350,1400,1550,"Sold","RODWELLS & CO DENILIQUIN",-35.5274,144.96,"DENILIQUIN","NSW"]
[8265844,275,"Lot 275",40,"Cows","Angus/Angus",100,"4 H",35,"Cow","PTIC Cows",false,660.4,323.39999999999998,"Years","6 to 10",null,null,"HARDEN","SW Slopes & Plains",1250,1300,1300,"Sold","MCKEAN MCGREGOR P/L",-36.758699999999997,144.28399999999999,"BENDIGO","VIC"]
[8265496,276,"Lot 276",24,"Heifers","Angus/Angus",100,"3 H",50,"Heifer","PTIC Heifers",false,488.3,274.7,"Months","17 to 19",null,null,"BOOROWA","SW Slopes & Plains",1480,1700,1490,"Passed In","ELDERS GUNDAGAI",-35.065199999999997,148.108,"GUNDAGAI","NSW"]
[8265666,277,"Lot 277",24,"Heifers","Angus/Angus",100,"3 H",50,"Heifer","PTIC Heifers",false,488.3,274.7,"Months","17 to 19",null,null,"BOOROWA","SW Slopes & Plains",1480,1700,null,"No Bids"]
[8265798,278,"Lot 278",32,"Cows","Angus/Angus",100,"3 L",40,"Cow","PTIC Cows",false,543.5,271.7,"Years","2.5 to 4.5",null,null,"JUGIONG","SW Slopes & Plains",1300,1400,1430,"Sold","BEDE ROCHE FAMILY P/SHIP P/L",-35.298499999999997,148.05099999999999,"ADELONG","NSW"]
[8265828,279,"Lot 279",31,"Cows","Angus/Angus",100,"3 H",34,"Cow","PTIC Cows",false,604.5,302.3,"Years","5.5 to 8.5",null,null,"JUGIONG","SW Slopes & Plains",1250,1350,1350,"Sold","CUYUAC ",-37.371099999999998,141.565,"NAREEN","VIC"]
[8263418,280,"Lot 280",31,"Steers","HEREFORD CROSS/Angus/Shorthorn",100,1,55,"Steer","Steers",false,266,131.6,"Months","12 to 15",null,null,"ADJUNGBILLY","SW Slopes & Plains",730,750,745,"Passed In","ELDERS WAGGA WAGGA",-35.125799999999998,147.35400000000001,"WAGGA WAGGA","NSW"]
[8265291,281,"Lot 281",12,"Steers","Wagyu/Angus",100,2,92,"Steer","Steers",false,307.5,160.19999999999999,"Months","13 to 14",null,null,"CROOKWELL","Southern Tablelands",1440,1470,1450,"Passed In","A AND C PAGE",-34.331800000000001,149.36799999999999,"BINDA","NSW"]
[8265348,282,"Lot 282",6,"Steers","Wagyu/Angus",100,"3 L",83,"Steer","Crossbred Wagyu F1 50% Backgrounder Steers",false,446.2,246.3,"Months","15 to 16",null,null,"CROOKWELL","Southern Tablelands",1750,1780,null,"No Bids"]
[8265330,283,"Lot 283",17,"Cows & Calves","Square Meter/Square Meter",88,2,82,"Cow","Cows & Calves",false,413.2,187.4,"Years","3 to 13",null,null,"GUNGAHLIN","Monaro NSW",1000,1100,1065,"Passed In","C Johnstone",-35.598500000000001,147.71799999999999,"CARABOST","NSW"]
[8265933,284,"Lot 284",40,"Cows","Hereford/Hereford",100,"3 H",40,"Cow","PTIC Cows",false,424.6,210.1,"Years","2.5 to 3.5",null,null,"COOMA","Monaro NSW",1250,1350,null,"No Bids"]
[8266344,285,"Lot 285",40,"Cows","Hereford/Hereford",100,"3 H",40,"Cow","PTIC Cows",false,424.6,210.1,"Years","2.5 to 3.5",null,null,"COOMA","Monaro NSW",1250,1350,null,"No Bids"]
[8265410,286,"Lot 286",50,"Heifers","Angus/Angus",100,2,52,"Heifer","NSM Future Breeders",false,382.1,208.1,"Months","16 to 17",null,null,"TUMBARUMBA","Riverina NSW",940,995,1050,"Sold","LANDMARK YEA",-37.212400000000002,145.42400000000001,"YEA","VIC"]
[8265747,287,"Lot 287",52,"Heifers","ULTRA-BLACK/ULTRA-BLACK",100,2,74,"Heifer","PTIC Heifers",false,464.3,244.1,"Months","16 to 18",null,null,"DENILIQUIN","Riverina NSW",1450,1500,1470,"Passed In","FP NEVINS & CO ROCHESTER",-36.361899999999999,144.69900000000001,"ROCHESTER","VIC"]
[8264120,288,"Lot 288",46,"Cows & Calves","Santa Gertrudis/Santa Gertrudis",98,2,59,"Cow","Cows & Calves",false,499.9,214.2,"Months","39 to 42",null,null,"MOULAMEIN","Riverina NSW",1500,1600,1600,"Sold","LANDMARK WAGGA WAGGA",-35.125799999999998,147.35400000000001,"WAGGA WAGGA","NSW"]
[8265720,289,"Lot 289",35,"Cows","Brahman/Brahman Cross",23,2,49,"Cow","PTIC Cows",false,630.1,289.8,"Years","5 to 6",null,null,"BARHAM","Riverina NSW",1300,1350,1320,"Passed In","FP NEVINS & CO ROCHESTER",-36.361899999999999,144.69900000000001,"ROCHESTER","VIC"]
[8265739,290,"Lot 290",7,"Heifers","Angus/Angus Cross",100,"3 L",43,"Heifer","Station Mated Heifers",false,401,228,"Months","13 to 15",null,null,"BARINGHUP","Central Victoria",1000,1300,null,"No Bids"]
[8265925,291,"Lot 291",16,"Steers","Angus/Angus",100,2,63,"Steer","Steers",false,521.1,263.3,"Months","17 to 18",null,null,"LONGWOOD","Central Victoria",1380,1400,null,"No Bids"]
[8266387,292,"Lot 292",30,"Heifers","Angus/Angus",100,"3 L",53,"Heifer","PTIC Heifers",false,516,244.4,"Months","22 to 23",null,null,"LONGWOOD","Central Victoria",1640,1700,1700,"Sold","TJ & WL COPE",-36.440100000000001,145.22900000000001,"TATURA","VIC"]
[8266425,293,"Lot 293",22,"Cows","Angus/Angus",100,"4 L",46,"Cow","PTIC Cows",false,672.1,304.2,"Years","8 to 8",null,null,"LONGWOOD","Central Victoria",1450,1500,1490,"Passed In","ELDERS EUROA",-36.750900000000001,145.571,"EUROA","VIC"]
[8265089,294,"Lot 294",18,"Cows","Poll Hereford/Poll Hereford",83,"3 H",60,"Cow","PTIC Cows",false,599.5,302.89999999999998,"Years","3 to 3",null,null,"MANSFIELD","Central Victoria",1580,1600,null,"No Bids"]
[8264970,295,"Lot 295",19,"Heifers","Hereford/Hereford",100,"3 L",69,"Heifer","PTIC Heifers",false,510.2,252.4,"Months","22 to 23",null,null,"PYALONG","N/W Victoria",1410,1450,1420,"Passed In","J SUTHERLAND",-37.262,144.90799999999999,"WILLOWMAVIN","VIC"]
[8264899,296,"Lot 296",18,"Heifers","Shorthorn/Hereford",100,"3 H",55,"Heifer","PTIC Heifers",false,504,238.8,"Months","25 to 26",null,null,"PYALONG","N/W Victoria",1430,1500,1440,"Passed In","J SUTHERLAND",-37.262,144.90799999999999,"WILLOWMAVIN","VIC"]
[8264961,297,"Lot 297",17,"Heifers","Hereford/Hereford",100,"3 L",41,"Heifer","PTIC Heifers",false,496.3,245.6,"Months","22 to 23",null,null,"PYALONG","N/W Victoria",1440,1500,null,"No Bids"]
[8264988,298,"Lot 298",16,"Heifers","Hereford/Hereford",100,2,56,"Heifer","PTIC Heifers",false,441.3,218.3,"Months","22 to 23",null,null,"PYALONG","N/W Victoria",1280,1350,1290,"Passed In","J SUTHERLAND",-37.262,144.90799999999999,"WILLOWMAVIN","VIC"]
[8266204,299,"Lot 299",21,"Heifers","Hereford/Hereford",100,"3 L",65,"Heifer","Station Mated Heifers",false,558.1,258.5,"Months","22 to 23",null,null,"TARWIN LOWER","Gippsland Victoria",1450,1500,1490,"Passed In","HYGAIN FARMS",-38.060899999999997,145.41,"OFFICER","VIC"]
[8266298,300,"Lot 300",21,"Heifers","Hereford/Hereford",100,"3 L",65,"Heifer","Station Mated Heifers",false,558.1,258.5,"Months","22 to 23",null,null,"TARWIN LOWER","Gippsland Victoria",1450,1500,1490,"Passed In","HYGAIN FARMS",-38.060899999999997,145.41,"OFFICER","VIC"]
[8266301,301,"Lot 301",22,"Heifers","Hereford/Hereford",100,"3 L",50,"Heifer","Station Mated Heifers",false,505.7,234.2,"Months","22 to 23",null,null,"TARWIN LOWER","Gippsland Victoria",1400,1500,1410,"Passed In","ELDERS PAKENHAM",-38.078499999999998,145.483,"PAKENHAM","VIC"]
[8266336,302,"Lot 302",22,"Heifers","Hereford/Hereford",100,"3 L",50,"Heifer","Station Mated Heifers",false,505.7,234.2,"Months","22 to 23",null,null,"TARWIN LOWER","Gippsland Victoria",1400,1500,1410,"Passed In","ELDERS PAKENHAM",-38.078499999999998,145.483,"PAKENHAM","VIC"]
[8264732,303,"Lot 303",26,"Heifers","Angus/Angus",100,"3 H",32,"Heifer","NSM Future Breeders",false,490.9,250.7,"Months","16 to 18",null,null,"BALMORAL","S.W. Victoria",1180,1200,1200,"Sold","SCHUBERT BOERS",-36.0749,146.92400000000001,"ALBURY","NSW"]
[8264775,304,"Lot 304",25,"Heifers","Angus/Hereford/Angus",100,"4 H",40,"Heifer","NSM Future Breeders",false,476.8,243.5,"Months","16 to 18",null,null,"BALMORAL","S.W. Victoria",1150,1200,1155,"Passed In","SCHUBERT BOERS",-36.0749,146.92400000000001,"ALBURY","NSW"]
[8264740,305,"Lot 305",40,"Heifers","Angus/Angus",100,"4 H",26,"Heifer","NSM Future Breeders",false,442.2,225.8,"Months","16 to 18",null,null,"BALMORAL","S.W. Victoria",1100,1150,1105,"Passed In","SCHUBERT BOERS",-36.0749,146.92400000000001,"ALBURY","NSW"]
[8264759,306,"Lot 306",56,"Heifers","Hereford/Hereford",100,"3 H",30,"Heifer","NSM Future Breeders",false,429,219.1,"Months","16 to 18",null,null,"BALMORAL","S.W. Victoria",960,980,1025,"Sold","SCHUBERT BOERS",-36.0749,146.92400000000001,"ALBURY","NSW"]
[8264791,307,"Lot 307",9,"Heifers","Angus/Hereford/Angus",100,"4 H",23,"Heifer","NSM Future Breeders",false,424.8,216.9,"Months","16 to 18",null,null,"BALMORAL","S.W. Victoria",1050,1100,1055,"Passed In","SCHUBERT BOERS",-36.0749,146.92400000000001,"ALBURY","NSW"]
[8265968,308,"Lot 308",20,"Heifers","Angus/Friesian",100,"4 L",50,"Heifer","PTIC Heifers",false,674.5,383.4,"Months","35 to 36",null,null,"MENA PARK","S.W. Victoria",1600,1650,1610,"Passed In","TB WHITE & SONS PTY LTD",-37.562100000000001,143.85599999999999,"BALLARAT","VIC"]
[8264236,309,"Lot 309",91,"Heifers","Angus/Angus",100,2,84,"Heifer","NSM Future Breeders",false,362.9,187.2,"Months","16 to 17",null,null,"KARIAH","S.W. Victoria",0,0,null,"Withdrawn"]
[8264260,310,"Lot 310",34,"Heifers","Angus/Angus/Hereford",97,2,91,"Heifer","NSM Future Breeders",false,372.2,192,"Months","16 to 17",null,null,"KARIAH","S.W. Victoria",1000,1030,1005,"Passed In","HF RICHARDSON & CO",-38.155700000000003,144.346,"NEWTOWN","VIC"]
[8264279,311,"Lot 311",92,"Heifers","Angus/Angus",100,2,92,"Heifer","NSM Future Breeders",false,380.3,200.1,"Months","16 to 17",null,null,"MACARTHUR","S.W. Victoria",0,0,null,"Withdrawn"]
[8265771,312,"Lot 312",23,"Heifers","Shorthorn/Shorthorn",100,2,70,"Heifer","PTIC Heifers",false,491.5,248.3,"Months","20 to 22",null,null,"PASCHENDALE","S.W. Victoria",1330,1400,null,"No Bids"]
[8263140,313,"Lot 313",16,"Heifers","Simmental/Simmental/Hereford",100,2,69,"Heifer","Heifers",false,328.8,173,"Months","11 to 14",null,null,"NARACOORTE","Lower SE S.A.",880,930,null,"No Bids"]
[8263175,314,"Lot 314",15,"Heifers","Angus/Simmental/Hereford",100,2,93,"Heifer","Heifers",false,337.2,177.5,"Months","11 to 14",null,null,"NARACOORTE","Lower SE S.A.",910,960,null,"No Bids"]
[8265690,315,"Lot 315",50,"Cows & Calves","Hereford/Hereford/Shorthorn",100,2,26,"Cow","Station Mated Cows & Calves",false,539.70000000000005,261.7,"Years","6 to 7",null,null,"KEITH","Upper SE S.A.",1650,1800,null,"No Bids"]
[8265526,316,"Lot 316",16,"Heifers","Angus/Angus",100,"3 H",75,"Heifer","PTIC Heifers",false,531.79999999999995,285.5,"Months","27 to 28",null,null,"STRATHALBYN","Central & Hills S.A.",1550,1600,1600,"Sold","ELDERS STRATHALBYN",-35.259799999999998,138.892,"STRATHALBYN","SA"]
[8265305,317,"Lot 317",16,"Heifers","Angus/Angus",100,2,39,"Heifer","PTIC Heifers",false,524.6,281.60000000000002,"Months","20 to 33",null,null,"FINNISS","Central & Hills S.A.",1450,1500,1460,"Passed In","ELDERS STRATHALBYN",-35.259799999999998,138.892,"STRATHALBYN","SA"]

{"sheet":"ckg table","index":4,"n_rows":2000,"n_cols":4,"rows_kept":2000,"cut":false,"hidden":true,"merged":[]}
[{"$f":"\"'Results'!\"&IF(MATCH(A$2,INDIRECT(\"Results!1:1\"),0)>=53,\"b\"&CHAR(64+MATCH(A$2,INDIRECT(\"Results!1:1\"),0)-52),IF(MATCH(A$2,INDIRECT(\"Results!1:1\"),0)>=27,\"A\"&CHAR(64+MATCH(A$2,INDIRECT(\"Results!1:1\"),0)-26),CHAR(64+MATCH(A$2,INDIRECT(\"Results!1:1\"),0))))","v":"'Results'!M"},"Price (c/kg)","State",{"$f":"ROW(A1)","v":1}]
["LiveWeight ",{"$f":"IFERROR((INDIRECT($A$3&ROW($A2))/INDIRECT($A$1&ROW($A2)))*100,\"\")","v":299.71455756422455},{"$f":"IFERROR(VLOOKUP(INDIRECT($A$5&ROW($A2)),'State Lookup'!$A:$B,2,FALSE),\"\")","v":"QLD"},{"$f":"ROW($A2)","v":2}]
[{"$f":"\"'Results'!\"&IF(MATCH(A4,INDIRECT(\"Results!1:1\"),0)>=53,\"b\"&CHAR(64+MATCH(A4,INDIRECT(\"Results!1:1\"),0)-52),IF(MATCH(A4,INDIRECT(\"Results!1:1\"),0)>=27,\"A\"&CHAR(64+MATCH(A4,INDIRECT(\"Results!1:1\"),0)-26),CHAR(64+MATCH(A4,INDIRECT(\"Results!1:1\"),0))))","v":"'Results'!W"},{"$f":"IFERROR((INDIRECT($A$3&ROW($A3))/INDIRECT($A$1&ROW($A3)))*100,\"\")","v":301.05973025048172},{"$f":"IFERROR(VLOOKUP(INDIRECT($A$5&ROW($A3)),'State Lookup'!$A:$B,2,FALSE),\"\")","v":"QLD"}]
["BidPrice ",307.50605326876513,{"$f":"IFERROR(VLOOKUP(INDIRECT($A$5&ROW($A4)),'State Lookup'!$A:$B,2,FALSE),\"\")","v":"QLD"}]
[{"$f":"\"'Results'!\"&IF(MATCH(A6,INDIRECT(\"Results!1:1\"),0)>=53,\"b\"&CHAR(64+MATCH(A6,INDIRECT(\"Results!1:1\"),0)-52),IF(MATCH(A6,INDIRECT(\"Results!1:1\"),0)>=27,\"A\"&CHAR(64+MATCH(A6,INDIRECT(\"Results!1:1\"),0)-26),CHAR(64+MATCH(A6,INDIRECT(\"Results!1:1\"),0))))","v":"'Results'!T"},307.11444984533802,{"$f":"IFERROR(VLOOKUP(INDIRECT($A$5&ROW($A5)),'State Lookup'!$A:$B,2,FALSE),\"\")","v":"QLD"}]
["DeliveryRegion ",313.56655290102384,{"$f":"IFERROR(VLOOKUP(INDIRECT($A$5&ROW($A6)),'State Lookup'!$A:$B,2,FALSE),\"\")","v":"QLD"}]
[null,266.52452025586354,{"$f":"IFERROR(VLOOKUP(INDIRECT($A$5&ROW(#REF!)),'State Lookup'!$A:$B,2,FALSE),\"\")","v":""}]
[null,270.01421127427761,{"$f":"IFERROR(VLOOKUP(INDIRECT($A$5&ROW(#REF!)),'State Lookup'!$A:$B,2,FALSE),\"\")","v":""}]
[null,267.97107613781372,{"$f":"IFERROR(VLOOKUP(INDIRECT($A$5&ROW($A9)),'State Lookup'!$A:$B,2,FALSE),\"\")","v":"QLD"}]
[null,276.78571428571428,{"$f":"IFERROR(VLOOKUP(INDIRECT($A$5&ROW($A10)),'State Lookup'!$A:$B,2,FALSE),\"\")","v":"QLD"}]
[null,334.78260869565219,{"$f":"IFERROR(VLOOKUP(INDIRECT($A$5&ROW($A11)),'State Lookup'!$A:$B,2,FALSE),\"\")","v":"QLD"}]
[null,0,{"$f":"IFERROR(VLOOKUP(INDIRECT($A$5&ROW($A12)),'State Lookup'!$A:$B,2,FALSE),\"\")","v":"QLD"}]
[null,0,{"$f":"IFERROR(VLOOKUP(INDIRECT($A$5&ROW($A13)),'State Lookup'!$A:$B,2,FALSE),\"\")","v":"QLD"}]
[null,309.99999999999994,{"$f":"IFERROR(VLOOKUP(INDIRECT($A$5&ROW($A14)),'State Lookup'!$A:$B,2,FALSE),\"\")","v":"QLD"}]
[null,292.18266253869973,{"$f":"IFERROR(VLOOKUP(INDIRECT($A$5&ROW($A15)),'State Lookup'!$A:$B,2,FALSE),\"\")","v":"QLD"}]
[null,307.78638401956783,{"$f":"IFERROR(VLOOKUP(INDIRECT($A$5&ROW($A16)),'State Lookup'!$A:$B,2,FALSE),\"\")","v":"QLD"}]
[null,0,{"$f":"IFERROR(VLOOKUP(INDIRECT($A$5&ROW($A17)),'State Lookup'!$A:$B,2,FALSE),\"\")","v":"QLD"}]
[null,0,{"$f":"IFERROR(VLOOKUP(INDIRECT($A$5&ROW($A18)),'State Lookup'!$A:$B,2,FALSE),\"\")","v":"QLD"}]
[null,269.26153025859765,{"$f":"IFERROR(VLOOKUP(INDIRECT($A$5&ROW($A19)),'State Lookup'!$A:$B,2,FALSE),\"\")","v":"QLD"}]
[null,268.18906001062135,{"$f":"IFERROR(VLOOKUP(INDIRECT($A$5&ROW($A20)),'State Lookup'!$A:$B,2,FALSE),\"\")","v":"QLD"}]
[null,301.10404817664772,{"$f":"IFERROR(VLOOKUP(INDIRECT($A$5&ROW($A21)),'State Lookup'!$A:$B,2,FALSE),\"\")","v":"QLD"}]
[null,247.82923299565849,{"$f":"IFERROR(VLOOKUP(INDIRECT($A$5&ROW($A22)),'State Lookup'!$A:$B,2,FALSE),\"\")","v":"QLD"}]
[null,274.72527472527474,{"$f":"IFERROR(VLOOKUP(INDIRECT($A$5&ROW($A23)),'State Lookup'!$A:$B,2,FALSE),\"\")","v":"QLD"}]
[null,0,{"$f":"IFERROR(VLOOKUP(INDIRECT($A$5&ROW($A24)),'State Lookup'!$A:$B,2,FALSE),\"\")","v":"QLD"}]
[null,264.86049332794175,{"$f":"IFERROR(VLOOKUP(INDIRECT($A$5&ROW($A25)),'State Lookup'!$A:$B,2,FALSE),\"\")","v":"QLD"}]
[null,270.46263345195729,{"$f":"IFERROR(VLOOKUP(INDIRECT($A$5&ROW($A26)),'State Lookup'!$A:$B,2,FALSE),\"\")","v":"QLD"}]
[null,276.61832331093035,{"$f":"IFERROR(VLOOKUP(INDIRECT($A$5&ROW($A27)),'State Lookup'!$A:$B,2,FALSE),\"\")","v":"QLD"}]
[null,271.68632893823735,{"$f":"IFERROR(VLOOKUP(INDIRECT($A$5&ROW($A28)),'State Lookup'!$A:$B,2,FALSE),\"\")","v":"QLD"}]
[null,301.78861788617888,{"$f":"IFERROR(VLOOKUP(INDIRECT($A$5&ROW($A29)),'State Lookup'!$A:$B,2,FALSE),\"\")","v":"QLD"}]
[null,295.28695094581599,{"$f":"IFERROR(VLOOKUP(INDIRECT($A$5&ROW($A30)),'State Lookup'!$A:$B,2,FALSE),\"\")","v":"QLD"}]
[null,251.57053112507143,{"$f":"IFERROR(VLOOKUP(INDIRECT($A$5&ROW($A31)),'State Lookup'!$A:$B,2,FALSE),\"\")","v":"NSW"}]
[null,296.11650485436894,{"$f":"IFERROR(VLOOKUP(INDIRECT($A$5&ROW($A32)),'State Lookup'!$A:$B,2,FALSE),\"\")","v":"NSW"}]
[null,270.05730659025789,{"$f":"IFERROR(VLOOKUP(INDIRECT($A$5&ROW($A33)),'State Lookup'!$A:$B,2,FALSE),\"\")","v":"NSW"}]
[null,331.81252592285358,{"$f":"IFERROR(VLOOKUP(INDIRECT($A$5&ROW($A34)),'State Lookup'!$A:$B,2,FALSE),\"\")","v":"NSW"}]
[null,287.06083976006857,{"$f":"IFERROR(VLOOKUP(INDIRECT($A$5&ROW($A35)),'State Lookup'!$A:$B,2,FALSE),\"\")","v":"NSW"}]
[null,325.99667774086379,{"$f":"IFERROR(VLOOKUP(INDIRECT($A$5&ROW($A36)),'State Lookup'!$A:$B,2,FALSE),\"\")","v":"NSW"}]
[null,269.91150442477874,{"$f":"IFERROR(VLOOKUP(INDIRECT($A$5&ROW($A37)),'State Lookup'!$A:$B,2,FALSE),\"\")","v":"NSW"}]
[null,298.31387808041507,{"$f":"IFERROR(VLOOKUP(INDIRECT($A$5&ROW($A38)),'State Lookup'!$A:$B,2,FALSE),\"\")","v":"NSW"}]
[null,254.66120964074577,{"$f":"IFERROR(VLOOKUP(INDIRECT($A$5&ROW($A39)),'State Lookup'!$A:$B,2,FALSE),\"\")","v":"NSW"}]
[null,332.10896847260483,{"$f":"IFERROR(VLOOKUP(INDIRECT($A$5&ROW($A40)),'State Lookup'!$A:$B,2,FALSE),\"\")","v":"NSW"}]
[null,294.7052947052947,{"$f":"IFERROR(VLOOKUP(INDIRECT($A$5&ROW($A41)),'State Lookup'!$A:$B,2,FALSE),\"\")","v":"NSW"}]
[null,378.78787878787881,{"$f":"IFERROR(VLOOKUP(INDIRECT($A$5&ROW($A42)),'State Lookup'!$A:$B,2,FALSE),\"\")","v":"NSW"}]
[null,0,{"$f":"IFERROR(VLOOKUP(INDIRECT($A$5&ROW($A43)),'State Lookup'!$A:$B,2,FALSE),\"\")","v":"NSW"}]
[null,330.5519897304236,{"$f":"IFERROR(VLOOKUP(INDIRECT($A$5&ROW($A44)),'State Lookup'!$A:$B,2,FALSE),\"\")","v":"NSW"}]
[null,291.94512838550827,{"$f":"IFERROR(VLOOKUP(INDIRECT($A$5&ROW($A45)),'State Lookup'!$A:$B,2,FALSE),\"\")","v":"NSW"}]
[null,274.33206106870227,{"$f":"IFERROR(VLOOKUP(INDIRECT($A$5&ROW($A46)),'State Lookup'!$A:$B,2,FALSE),\"\")","v":"NSW"}]
[null,0,{"$f":"IFERROR(VLOOKUP(INDIRECT($A$5&ROW($A47)),'State Lookup'!$A:$B,2,FALSE),\"\")","v":"NSW"}]
[null,263.62664766654791,{"$f":"IFERROR(VLOOKUP(INDIRECT($A$5&ROW($A48)),'State Lookup'!$A:$B,2,FALSE),\"\")","v":"NSW"}]
[null,303.030303030303,{"$f":"IFERROR(VLOOKUP(INDIRECT($A$5&ROW($A49)),'State Lookup'!$A:$B,2,FALSE),\"\")","v":"NSW"}]
[null,266.02176541717051,{"$f":"IFERROR(VLOOKUP(INDIRECT($A$5&ROW($A50)),'State Lookup'!$A:$B,2,FALSE),\"\")","v":"NSW"}]
[null,287.08133971291863,{"$f":"IFERROR(VLOOKUP(INDIRECT($A$5&ROW($A51)),'State Lookup'!$A:$B,2,FALSE),\"\")","v":"NSW"}]
[null,309.54631379962194,{"$f":"IFERROR(VLOOKUP(INDIRECT($A$5&ROW($A52)),'State Lookup'!$A:$B,2,FALSE),\"\")","v":"NSW"}]
[null,359.85695127402772,{"$f":"IFERROR(VLOOKUP(INDIRECT($A$5&ROW($A53)),'State Lookup'!$A:$B,2,FALSE),\"\")","v":"NSW"}]
[null,334.17402269861287,{"$f":"IFERROR(VLOOKUP(INDIRECT($A$5&ROW($A54)),'State Lookup'!$A:$B,2,FALSE),\"\")","v":"NSW"}]
[null,372.91462217860646,{"$f":"IFERROR(VLOOKUP(INDIRECT($A$5&ROW($A55)),'State Lookup'!$A:$B,2,FALSE),\"\")","v":"NSW"}]
[null,373.09769268532153,{"$f":"IFERROR(VLOOKUP(INDIRECT($A$5&ROW($A56)),'State Lookup'!$A:$B,2,FALSE),\"\")","v":"NSW"}]
[null,315.78947368421052,{"$f":"IFERROR(VLOOKUP(INDIRECT($A$5&ROW($A57)),'State Lookup'!$A:$B,2,FALSE),\"\")","v":"NSW"}]
[null,284.74399164054336,{"$f":"IFERROR(VLOOKUP(INDIRECT($A$5&ROW($A58)),'State Lookup'!$A:$B,2,FALSE),\"\")","v":"NSW"}]
[null,259.3240093240093,{"$f":"IFERROR(VLOOKUP(INDIRECT($A$5&ROW($A59)),'State Lookup'!$A:$B,2,FALSE),\"\")","v":"NSW"}]
[null,255.52898983861328,{"$f":"IFERROR(VLOOKUP(INDIRECT($A$5&ROW($A60)),'State Lookup'!$A:$B,2,FALSE),\"\")","v":"NSW"}]
[null,261.67698368036014,{"$f":"IFERROR(VLOOKUP(INDIRECT($A$5&ROW($A61)),'State Lookup'!$A:$B,2,FALSE),\"\")","v":"NSW"}]
[null,0,{"$f":"IFERROR(VLOOKUP(INDIRECT($A$5&ROW($A62)),'State Lookup'!$A:$B,2,FALSE),\"\")","v":"NSW"}]
[null,391.30434782608694,{"$f":"IFERROR(VLOOKUP(INDIRECT($A$5&ROW($A63)),'State Lookup'!$A:$B,2,FALSE),\"\")","v":"NSW"}]
[null,332.17649975210708,{"$f":"IFERROR(VLOOKUP(INDIRECT($A$5&ROW($A64)),'State Lookup'!$A:$B,2,FALSE),\"\")","v":"NSW"}]
[null,249.64739069111425,{"$f":"IFERROR(VLOOKUP(INDIRECT($A$5&ROW($A65)),'State Lookup'!$A:$B,2,FALSE),\"\")","v":"NSW"}]
[null,322.4082650516566,{"$f":"IFERROR(VLOOKUP(INDIRECT($A$5&ROW($A66)),'State Lookup'!$A:$B,2,FALSE),\"\")","v":"NSW"}]
[null,{"$f":"IFERROR((INDIRECT($A$3&ROW($A67))/INDIRECT($A$1&ROW($A67)))*100,\"\")","v":333.83158943697066},{"$f":"IFERROR(VLOOKUP(INDIRECT($A$5&ROW($A67)),'State Lookup'!$A:$B,2,FALSE),\"\")","v":"NSW"}]
[null,314.80431083380597,{"$f":"IFERROR(VLOOKUP(INDIRECT($A$5&ROW($A68)),'State Lookup'!$A:$B,2,FALSE),\"\")","v":"NSW"}]
[null,323.55679702048417,{"$f":"IFERROR(VLOOKUP(INDIRECT($A$5&ROW($A69)),'State Lookup'!$A:$B,2,FALSE),\"\")","v":"NSW"}]
[null,311.72511512575272,{"$f":"IFERROR(VLOOKUP(INDIRECT($A$5&ROW($A70)),'State Lookup'!$A:$B,2,FALSE),\"\")","v":"VIC"}]
[null,285.00124470998259,{"$f":"IFERROR(VLOOKUP(INDIRECT($A$5&ROW($A71)),'State Lookup'!$A:$B,2,FALSE),\"\")","v":"SA"}]
[null,278.21019771071803,{"$f":"IFERROR(VLOOKUP(INDIRECT($A$5&ROW($A72)),'State Lookup'!$A:$B,2,FALSE),\"\")","v":"SA"}]
[null,275.07386192342483,{"$f":"IFERROR(VLOOKUP(INDIRECT($A$5&ROW($A73)),'State Lookup'!$A:$B,2,FALSE),\"\")","v":"SA"}]
[null,261.54295733489187,{"$f":"IFERROR(VLOOKUP(INDIRECT($A$5&ROW($A74)),'State Lookup'!$A:$B,2,FALSE),\"\")","v":"SA"}]
[null,274.40083362278574,{"$f":"IFERROR(VLOOKUP(INDIRECT($A$5&ROW($A75)),'State Lookup'!$A:$B,2,FALSE),\"\")","v":"SA"}]
[null,243.95637769188295,{"$f":"IFERROR(VLOOKUP(INDIRECT($A$5&ROW($A76)),'State Lookup'!$A:$B,2,FALSE),\"\")","v":"SA"}]
[null,261.89524190323874,{"$f":"IFERROR(VLOOKUP(INDIRECT($A$5&ROW($A77)),'State Lookup'!$A:$B,2,FALSE),\"\")","v":"SA"}]
[null,284.59273797841018,{"$f":"IFERROR(VLOOKUP(INDIRECT($A$5&ROW($A78)),'State Lookup'!$A:$B,2,FALSE),\"\")","v":"QLD"}]
[null,290.3946388682055,{"$f":"IFERROR(VLOOKUP(INDIRECT($A$5&ROW($A79)),'State Lookup'!$A:$B,2,FALSE),\"\")","v":"QLD"}]
[null,289.54802259887009,{"$f":"IFERROR(VLOOKUP(INDIRECT($A$5&ROW($A80)),'State Lookup'!$A:$B,2,FALSE),\"\")","v":"QLD"}]
[null,0,{"$f":"IFERROR(VLOOKUP(INDIRECT($A$5&ROW($A81)),'State Lookup'!$A:$B,2,FALSE),\"\")","v":"QLD"}]
[null,0,{"$f":"IFERROR(VLOOKUP(INDIRECT($A$5&ROW($A82)),'State Lookup'!$A:$B,2,FALSE),\"\")","v":"QLD"}]
[null,278.94002789400281,{"$f":"IFERROR(VLOOKUP(INDIRECT($A$5&ROW($A83)),'State Lookup'!$A:$B,2,FALSE),\"\")","v":"QLD"}]
[null,324.75643267549339,{"$f":"IFERROR(VLOOKUP(INDIRECT($A$5&ROW($A84)),'State Lookup'!$A:$B,2,FALSE),\"\")","v":"QLD"}]
[null,298.28850855745725,{"$f":"IFERROR(VLOOKUP(INDIRECT($A$5&ROW($A85)),'State Lookup'!$A:$B,2,FALSE),\"\")","v":"QLD"}]
[null,294.81132075471697,{"$f":"IFERROR(VLOOKUP(INDIRECT($A$5&ROW($A86)),'State Lookup'!$A:$B,2,FALSE),\"\")","v":"QLD"}]
[null,204.1693531055233,{"$f":"IFERROR(VLOOKUP(INDIRECT($A$5&ROW($A87)),'State Lookup'!$A:$B,2,FALSE),\"\")","v":"QLD"}]
[null,210.99116781157997,{"$f":"IFERROR(VLOOKUP(INDIRECT($A$5&ROW($A88)),'State Lookup'!$A:$B,2,FALSE),\"\")","v":"QLD"}]
[null,344.34879200222161,{"$f":"IFERROR(VLOOKUP(INDIRECT($A$5&ROW($A89)),'State Lookup'!$A:$B,2,FALSE),\"\")","v":"QLD"}]
[null,314.12253374870198,{"$f":"IFERROR(VLOOKUP(INDIRECT($A$5&ROW($A90)),'State Lookup'!$A:$B,2,FALSE),\"\")","v":"QLD"}]
[null,317.46031746031747,{"$f":"IFERROR(VLOOKUP(INDIRECT($A$5&ROW($A91)),'State Lookup'!$A:$B,2,FALSE),\"\")","v":"QLD"}]
[null,0,{"$f":"IFERROR(VLOOKUP(INDIRECT($A$5&ROW($A92)),'State Lookup'!$A:$B,2,FALSE),\"\")","v":"QLD"}]
[null,0,{"$f":"IFERROR(VLOOKUP(INDIRECT($A$5&ROW($A93)),'State Lookup'!$A:$B,2,FALSE),\"\")","v":"QLD"}]
[null,325.20325203252031,{"$f":"IFERROR(VLOOKUP(INDIRECT($A$5&ROW($A94)),'State Lookup'!$A:$B,2,FALSE),\"\")","v":"QLD"}]
[null,256.43147896879242,{"$f":"IFERROR(VLOOKUP(INDIRECT($A$5&ROW($A95)),'State Lookup'!$A:$B,2,FALSE),\"\")","v":"QLD"}]
[null,295.94189315838798,{"$f":"IFERROR(VLOOKUP(INDIRECT($A$5&ROW($A96)),'State Lookup'!$A:$B,2,FALSE),\"\")","v":"QLD"}]
[null,231.54848046309701,{"$f":"IFERROR(VLOOKUP(INDIRECT($A$5&ROW($A97)),'State Lookup'!$A:$B,2,FALSE),\"\")","v":"QLD"}]
[null,423.76160990712083,{"$f":"IFERROR(VLOOKUP(INDIRECT($A$5&ROW($A98)),'State Lookup'!$A:$B,2,FALSE),\"\")","v":"QLD"}]
[null,418.56060606060606,{"$f":"IFERROR(VLOOKUP(INDIRECT($A$5&ROW($A99)),'State Lookup'!$A:$B,2,FALSE),\"\")","v":"QLD"}]
[null,311.63159984120682,{"$f":"IFERROR(VLOOKUP(INDIRECT($A$5&ROW($A100)),'State Lookup'!$A:$B,2,FALSE),\"\")","v":"QLD"}]
[null,302.96909715209046,{"$f":"IFERROR(VLOOKUP(INDIRECT($A$5&ROW($A101)),'State Lookup'!$A:$B,2,FALSE),\"\")","v":"QLD"}]
[null,0,{"$f":"IFERROR(VLOOKUP(INDIRECT($A$5&ROW($A102)),'State Lookup'!$A:$B,2,FALSE),\"\")","v":"QLD"}]
[null,310.46312178387655,{"$f":"IFERROR(VLOOKUP(INDIRECT($A$5&ROW($A103)),'State Lookup'!$A:$B,2,FALSE),\"\")","v":"QLD"}]
[null,262.16614779616583,{"$f":"IFERROR(VLOOKUP(INDIRECT($A$5&ROW($A104)),'State Lookup'!$A:$B,2,FALSE),\"\")","v":"NSW"}]
[null,262.16614779616583,{"$f":"IFERROR(VLOOKUP(INDIRECT($A$5&ROW($A105)),'State Lookup'!$A:$B,2,FALSE),\"\")","v":"NSW"}]
[null,0,{"$f":"IFERROR(VLOOKUP(INDIRECT($A$5&ROW($A106)),'State Lookup'!$A:$B,2,FALSE),\"\")","v":"NSW"}]
[null,260.37735849056605,{"$f":"IFERROR(VLOOKUP(INDIRECT($A$5&ROW($A107)),'State Lookup'!$A:$B,2,FALSE),\"\")","v":"NSW"}]
[null,269.92031872509961,{"$f":"IFERROR(VLOOKUP(INDIRECT($A$5&ROW($A108)),'State Lookup'!$A:$B,2,FALSE),\"\")","v":"NSW"}]
[null,0,{"$f":"IFERROR(VLOOKUP(INDIRECT($A$5&ROW($A109)),'State Lookup'!$A:$B,2,FALSE),\"\")","v":"NSW"}]
[null,224.04052211182548,{"$f":"IFERROR(VLOOKUP(INDIRECT($A$5&ROW($A110)),'State Lookup'!$A:$B,2,FALSE),\"\")","v":"NSW"}]
[null,176.77266442820462,{"$f":"IFERROR(VLOOKUP(INDIRECT($A$5&ROW($A111)),'State Lookup'!$A:$B,2,FALSE),\"\")","v":"NSW"}]
[null,242.80399451732916,{"$f":"IFERROR(VLOOKUP(INDIRECT($A$5&ROW($A112)),'State Lookup'!$A:$B,2,FALSE),\"\")","v":"NSW"}]
[null,407.79744566435136,{"$f":"IFERROR(VLOOKUP(INDIRECT($A$5&ROW($A113)),'State Lookup'!$A:$B,2,FALSE),\"\")","v":"NSW"}]
[null,387.71851187808159,{"$f":"IFERROR(VLOOKUP(INDIRECT($A$5&ROW($A114)),'State Lookup'!$A:$B,2,FALSE),\"\")","v":"NSW"}]
[null,0,{"$f":"IFERROR(VLOOKUP(INDIRECT($A$5&ROW($A115)),'State Lookup'!$A:$B,2,FALSE),\"\")","v":"NSW"}]
[null,289.63153384747216,{"$f":"IFERROR(VLOOKUP(INDIRECT($A$5&ROW($A116)),'State Lookup'!$A:$B,2,FALSE),\"\")","v":"NSW"}]
[null,400.11037527593822,{"$f":"IFERROR(VLOOKUP(INDIRECT($A$5&ROW($A117)),'State Lookup'!$A:$B,2,FALSE),\"\")","v":"NSW"}]
[null,268.13880126182966,{"$f":"IFERROR(VLOOKUP(INDIRECT($A$5&ROW($A118)),'State Lookup'!$A:$B,2,FALSE),\"\")","v":"NSW"}]
[null,253.83141762452107,{"$f":"IFERROR(VLOOKUP(INDIRECT($A$5&ROW($A119)),'State Lookup'!$A:$B,2,FALSE),\"\")","v":"NSW"}]
[null,222.77227722772278,{"$f":"IFERROR(VLOOKUP(INDIRECT($A$5&ROW($A120)),'State Lookup'!$A:$B,2,FALSE),\"\")","v":"NSW"}]
[null,0,{"$f":"IFERROR(VLOOKUP(INDIRECT($A$5&ROW($A121)),'State Lookup'!$A:$B,2,FALSE),\"\")","v":"NSW"}]
[null,0,{"$f":"IFERROR(VLOOKUP(INDIRECT($A$5&ROW($A122)),'State Lookup'!$A:$B,2,FALSE),\"\")","v":"NSW"}]
[null,0,{"$f":"IFERROR(VLOOKUP(INDIRECT($A$5&ROW($A123)),'State Lookup'!$A:$B,2,FALSE),\"\")","v":"NSW"}]
[null,0,{"$f":"IFERROR(VLOOKUP(INDIRECT($A$5&ROW($A124)),'State Lookup'!$A:$B,2,FALSE),\"\")","v":"NSW"}]
[null,315.53398058252424,{"$f":"IFERROR(VLOOKUP(INDIRECT($A$5&ROW($A125)),'State Lookup'!$A:$B,2,FALSE),\"\")","v":"NSW"}]
[null,314.71090509880463,{"$f":"IFERROR(VLOOKUP(INDIRECT($A$5&ROW($A126)),'State Lookup'!$A:$B,2,FALSE),\"\")","v":"NSW"}]
[null,174.78717623618908,{"$f":"IFERROR(VLOOKUP(INDIRECT($A$5&ROW($A127)),'State Lookup'!$A:$B,2,FALSE),\"\")","v":"NSW"}]
[null,201.70606006753152,{"$f":"IFERROR(VLOOKUP(INDIRECT($A$5&ROW($A128)),'State Lookup'!$A:$B,2,FALSE),\"\")","v":"NSW"}]
[null,232.30088495575222,{"$f":"IFERROR(VLOOKUP(INDIRECT($A$5&ROW($A129)),'State Lookup'!$A:$B,2,FALSE),\"\")","v":"NSW"}]
[null,0,{"$f":"IFERROR(VLOOKUP(INDIRECT($A$5&ROW($A130)),'State Lookup'!$A:$B,2,FALSE),\"\")","v":"NSW"}]
[null,{"$f":"IFERROR((INDIRECT($A$3&ROW($A131))/INDIRECT($A$1&ROW($A131)))*100,\"\")","v":240.93672596262104},{"$f":"IFERROR(VLOOKUP(INDIRECT($A$5&ROW($A131)),'State Lookup'!$A:$B,2,FALSE),\"\")","v":"NSW"}]
[null,0,{"$f":"IFERROR(VLOOKUP(INDIRECT($A$5&ROW($A132)),'State Lookup'!$A:$B,2,FALSE),\"\")","v":"NSW"}]
[null,0,{"$f":"IFERROR(VLOOKUP(INDIRECT($A$5&ROW($A133)),'State Lookup'!$A:$B,2,FALSE),\"\")","v":"NSW"}]
[null,293.89741669786594,{"$f":"IFERROR(VLOOKUP(INDIRECT($A$5&ROW($A134)),'State Lookup'!$A:$B,2,FALSE),\"\")","v":"NSW"}]
[null,174.56104532462228,{"$f":"IFERROR(VLOOKUP(INDIRECT($A$5&ROW($A135)),'State Lookup'!$A:$B,2,FALSE),\"\")","v":"NSW"}]
[null,311.14718614718618,{"$f":"IFERROR(VLOOKUP(INDIRECT($A$5&ROW($A136)),'State Lookup'!$A:$B,2,FALSE),\"\")","v":"NSW"}]
[null,311.14718614718618,{"$f":"IFERROR(VLOOKUP(INDIRECT($A$5&ROW($A137)),'State Lookup'!$A:$B,2,FALSE),\"\")","v":"NSW"}]
[null,318.06167400881054,{"$f":"IFERROR(VLOOKUP(INDIRECT($A$5&ROW($A138)),'State Lookup'!$A:$B,2,FALSE),\"\")","v":"NSW"}]
[null,295.73590096286108,{"$f":"IFERROR(VLOOKUP(INDIRECT($A$5&ROW($A139)),'State Lookup'!$A:$B,2,FALSE),\"\")","v":"NSW"}]
[null,297.70092356062094,{"$f":"IFERROR(VLOOKUP(INDIRECT($A$5&ROW($A140)),'State Lookup'!$A:$B,2,FALSE),\"\")","v":"NSW"}]
[null,294.75338966398118,{"$f":"IFERROR(VLOOKUP(INDIRECT($A$5&ROW($A141)),'State Lookup'!$A:$B,2,FALSE),\"\")","v":"NSW"}]
[null,319.30333817126268,{"$f":"IFERROR(VLOOKUP(INDIRECT($A$5&ROW($A142)),'State Lookup'!$A:$B,2,FALSE),\"\")","v":"NSW"}]
[null,230.21582733812949,{"$f":"IFERROR(VLOOKUP(INDIRECT($A$5&ROW($A143)),'State Lookup'!$A:$B,2,FALSE),\"\")","v":"NSW"}]
[null,328.7871407696054,{"$f":"IFERROR(VLOOKUP(INDIRECT($A$5&ROW($A144)),'State Lookup'!$A:$B,2,FALSE),\"\")","v":"NSW"}]
[null,326.28467485220557,{"$f":"IFERROR(VLOOKUP(INDIRECT($A$5&ROW($A145)),'State Lookup'!$A:$B,2,FALSE),\"\")","v":"NSW"}]
[null,215.83319758918392,{"$f":"IFERROR(VLOOKUP(INDIRECT($A$5&ROW($A146)),'State Lookup'!$A:$B,2,FALSE),\"\")","v":"NSW"}]
[null,258.74769797421732,{"$f":"IFERROR(VLOOKUP(INDIRECT($A$5&ROW($A147)),'State Lookup'!$A:$B,2,FALSE),\"\")","v":"NSW"}]
[null,337.06699854801906,{"$f":"IFERROR(VLOOKUP(INDIRECT($A$5&ROW($A148)),'State Lookup'!$A:$B,2,FALSE),\"\")","v":"NSW"}]
[null,316.37843336724313,{"$f":"IFERROR(VLOOKUP(INDIRECT($A$5&ROW($A149)),'State Lookup'!$A:$B,2,FALSE),\"\")","v":"NSW"}]
[null,221.65876001963031,{"$f":"IFERROR(VLOOKUP(INDIRECT($A$5&ROW($A150)),'State Lookup'!$A:$B,2,FALSE),\"\")","v":"NSW"}]
[null,184.31487736818917,{"$f":"IFERROR(VLOOKUP(INDIRECT($A$5&ROW($A151)),'State Lookup'!$A:$B,2,FALSE),\"\")","v":"NSW"}]
[null,253.4750613246116,{"$f":"IFERROR(VLOOKUP(INDIRECT($A$5&ROW($A152)),'State Lookup'!$A:$B,2,FALSE),\"\")","v":"NSW"}]
[null,196.85039370078741,{"$f":"IFERROR(VLOOKUP(INDIRECT($A$5&ROW($A153)),'State Lookup'!$A:$B,2,FALSE),\"\")","v":"NSW"}]
[null,305.14028261314763,{"$f":"IFERROR(VLOOKUP(INDIRECT($A$5&ROW($A154)),'State Lookup'!$A:$B,2,FALSE),\"\")","v":"NSW"}]
[null,0,{"$f":"IFERROR(VLOOKUP(INDIRECT($A$5&ROW($A155)),'State Lookup'!$A:$B,2,FALSE),\"\")","v":"NSW"}]
[null,263.10947562097516,{"$f":"IFERROR(VLOOKUP(INDIRECT($A$5&ROW($A156)),'State Lookup'!$A:$B,2,FALSE),\"\")","v":"NSW"}]
[null,223.32506203473946,{"$f":"IFERROR(VLOOKUP(INDIRECT($A$5&ROW($A157)),'State Lookup'!$A:$B,2,FALSE),\"\")","v":"NSW"}]
[null,280.0751879699248,{"$f":"IFERROR(VLOOKUP(INDIRECT($A$5&ROW($A158)),'State Lookup'!$A:$B,2,FALSE),\"\")","v":"NSW"}]
[null,471.54471544715449,{"$f":"IFERROR(VLOOKUP(INDIRECT($A$5&ROW($A159)),'State Lookup'!$A:$B,2,FALSE),\"\")","v":"NSW"}]
[null,0,{"$f":"IFERROR(VLOOKUP(INDIRECT($A$5&ROW($A160)),'State Lookup'!$A:$B,2,FALSE),\"\")","v":"NSW"}]
[null,257.74443368828656,{"$f":"IFERROR(VLOOKUP(INDIRECT($A$5&ROW($A161)),'State Lookup'!$A:$B,2,FALSE),\"\")","v":"NSW"}]
[null,0,{"$f":"IFERROR(VLOOKUP(INDIRECT($A$5&ROW($A162)),'State Lookup'!$A:$B,2,FALSE),\"\")","v":"NSW"}]
[null,0,{"$f":"IFERROR(VLOOKUP(INDIRECT($A$5&ROW($A163)),'State Lookup'!$A:$B,2,FALSE),\"\")","v":"NSW"}]
[null,274.79717351478666,{"$f":"IFERROR(VLOOKUP(INDIRECT($A$5&ROW($A164)),'State Lookup'!$A:$B,2,FALSE),\"\")","v":"NSW"}]
[null,316.60564290329529,{"$f":"IFERROR(VLOOKUP(INDIRECT($A$5&ROW($A165)),'State Lookup'!$A:$B,2,FALSE),\"\")","v":"NSW"}]
[null,320.06401280256051,{"$f":"IFERROR(VLOOKUP(INDIRECT($A$5&ROW($A166)),'State Lookup'!$A:$B,2,FALSE),\"\")","v":"NSW"}]
[null,209.49055705443578,{"$f":"IFERROR(VLOOKUP(INDIRECT($A$5&ROW($A167)),'State Lookup'!$A:$B,2,FALSE),\"\")","v":"NSW"}]
[null,0,{"$f":"IFERROR(VLOOKUP(INDIRECT($A$5&ROW($A168)),'State Lookup'!$A:$B,2,FALSE),\"\")","v":"VIC"}]
[null,0,{"$f":"IFERROR(VLOOKUP(INDIRECT($A$5&ROW($A169)),'State Lookup'!$A:$B,2,FALSE),\"\")","v":"VIC"}]
[null,329.45736434108528,{"$f":"IFERROR(VLOOKUP(INDIRECT($A$5&ROW($A170)),'State Lookup'!$A:$B,2,FALSE),\"\")","v":"VIC"}]
[null,221.69320041660464,{"$f":"IFERROR(VLOOKUP(INDIRECT($A$5&ROW($A171)),'State Lookup'!$A:$B,2,FALSE),\"\")","v":"VIC"}]
[null,0,{"$f":"IFERROR(VLOOKUP(INDIRECT($A$5&ROW($A172)),'State Lookup'!$A:$B,2,FALSE),\"\")","v":"VIC"}]
[null,278.32222657781267,{"$f":"IFERROR(VLOOKUP(INDIRECT($A$5&ROW($A173)),'State Lookup'!$A:$B,2,FALSE),\"\")","v":"VIC"}]
[null,285.71428571428572,{"$f":"IFERROR(VLOOKUP(INDIRECT($A$5&ROW($A174)),'State Lookup'!$A:$B,2,FALSE),\"\")","v":"VIC"}]
[null,0,{"$f":"IFERROR(VLOOKUP(INDIRECT($A$5&ROW($A175)),'State Lookup'!$A:$B,2,FALSE),\"\")","v":"VIC"}]
[null,292.31815091774303,{"$f":"IFERROR(VLOOKUP(INDIRECT($A$5&ROW($A176)),'State Lookup'!$A:$B,2,FALSE),\"\")","v":"VIC"}]
[null,266.9772442214657,{"$f":"IFERROR(VLOOKUP(INDIRECT($A$5&ROW($A177)),'State Lookup'!$A:$B,2,FALSE),\"\")","v":"VIC"}]
[null,266.9772442214657,{"$f":"IFERROR(VLOOKUP(INDIRECT($A$5&ROW($A178)),'State Lookup'!$A:$B,2,FALSE),\"\")","v":"VIC"}]
[null,278.82143563377497,{"$f":"IFERROR(VLOOKUP(INDIRECT($A$5&ROW($A179)),'State Lookup'!$A:$B,2,FALSE),\"\")","v":"VIC"}]
[null,278.82143563377497,{"$f":"IFERROR(VLOOKUP(INDIRECT($A$5&ROW($A180)),'State Lookup'!$A:$B,2,FALSE),\"\")","v":"VIC"}]
[null,244.44897127724587,{"$f":"IFERROR(VLOOKUP(INDIRECT($A$5&ROW($A181)),'State Lookup'!$A:$B,2,FALSE),\"\")","v":"VIC"}]
[null,242.23993288590603,{"$f":"IFERROR(VLOOKUP(INDIRECT($A$5&ROW($A182)),'State Lookup'!$A:$B,2,FALSE),\"\")","v":"VIC"}]
[null,249.88692899140662,{"$f":"IFERROR(VLOOKUP(INDIRECT($A$5&ROW($A183)),'State Lookup'!$A:$B,2,FALSE),\"\")","v":"VIC"}]
[null,238.92773892773894,{"$f":"IFERROR(VLOOKUP(INDIRECT($A$5&ROW($A184)),'State Lookup'!$A:$B,2,FALSE),\"\")","v":"VIC"}]
[null,248.35216572504706,{"$f":"IFERROR(VLOOKUP(INDIRECT($A$5&ROW($A185)),'State Lookup'!$A:$B,2,FALSE),\"\")","v":"VIC"}]
[null,238.69532987398071,{"$f":"IFERROR(VLOOKUP(INDIRECT($A$5&ROW($A186)),'State Lookup'!$A:$B,2,FALSE),\"\")","v":"VIC"}]
[null,0,{"$f":"IFERROR(VLOOKUP(INDIRECT($A$5&ROW($A187)),'State Lookup'!$A:$B,2,FALSE),\"\")","v":"VIC"}]
[null,270.01612036539495,{"$f":"IFERROR(VLOOKUP(INDIRECT($A$5&ROW($A188)),'State Lookup'!$A:$B,2,FALSE),\"\")","v":"VIC"}]
[null,0,{"$f":"IFERROR(VLOOKUP(INDIRECT($A$5&ROW($A189)),'State Lookup'!$A:$B,2,FALSE),\"\")","v":"VIC"}]
[null,0,{"$f":"IFERROR(VLOOKUP(INDIRECT($A$5&ROW($A190)),'State Lookup'!$A:$B,2,FALSE),\"\")","v":"VIC"}]
[null,0,{"$f":"IFERROR(VLOOKUP(INDIRECT($A$5&ROW($A191)),'State Lookup'!$A:$B,2,FALSE),\"\")","v":"SA"}]
[null,0,{"$f":"IFERROR(VLOOKUP(INDIRECT($A$5&ROW($A192)),'State Lookup'!$A:$B,2,FALSE),\"\")","v":"SA"}]
[null,0,{"$f":"IFERROR(VLOOKUP(INDIRECT($A$5&ROW($A193)),'State Lookup'!$A:$B,2,FALSE),\"\")","v":"SA"}]
[null,300.86498683715683,{"$f":"IFERROR(VLOOKUP(INDIRECT($A$5&ROW($A194)),'State Lookup'!$A:$B,2,FALSE),\"\")","v":"SA"}]
[null,{"$f":"IFERROR((INDIRECT($A$3&ROW($A195))/INDIRECT($A$1&ROW($A195)))*100,\"\")","v":278.3072817384674},{"$f":"IFERROR(VLOOKUP(INDIRECT($A$5&ROW($A195)),'State Lookup'!$A:$B,2,FALSE),\"\")","v":"SA"}]
[null,"",{"$f":"IFERROR(VLOOKUP(INDIRECT($A$5&ROW($A196)),'State Lookup'!$A:$B,2,FALSE),\"\")","v":""}]
[null,"",{"$f":"IFERROR(VLOOKUP(INDIRECT($A$5&ROW($A197)),'State Lookup'!$A:$B,2,FALSE),\"\")","v":""}]
[null,"",{"$f":"IFERROR(VLOOKUP(INDIRECT($A$5&ROW($A198)),'State Lookup'!$A:$B,2,FALSE),\"\")","v":""}]
[null,"",{"$f":"IFERROR(VLOOKUP(INDIRECT($A$5&ROW($A199)),'State Lookup'!$A:$B,2,FALSE),\"\")","v":""}]
[null,"",{"$f":"IFERROR(VLOOKUP(INDIRECT($A$5&ROW($A200)),'State Lookup'!$A:$B,2,FALSE),\"\")","v":""}]
[null,"",{"$f":"IFERROR(VLOOKUP(INDIRECT($A$5&ROW($A201)),'State Lookup'!$A:$B,2,FALSE),\"\")","v":""}]
[null,"",{"$f":"IFERROR(VLOOKUP(INDIRECT($A$5&ROW($A202)),'State Lookup'!$A:$B,2,FALSE),\"\")","v":""}]
[null,"",{"$f":"IFERROR(VLOOKUP(INDIRECT($A$5&ROW($A203)),'State Lookup'!$A:$B,2,FALSE),\"\")","v":""}]
[null,"",{"$f":"IFERROR(VLOOKUP(INDIRECT($A$5&ROW($A204)),'State Lookup'!$A:$B,2,FALSE),\"\")","v":""}]
[null,"",{"$f":"IFERROR(VLOOKUP(INDIRECT($A$5&ROW($A205)),'State Lookup'!$A:$B,2,FALSE),\"\")","v":""}]
[null,"",{"$f":"IFERROR(VLOOKUP(INDIRECT($A$5&ROW($A206)),'State Lookup'!$A:$B,2,FALSE),\"\")","v":""}]
[null,"",{"$f":"IFERROR(VLOOKUP(INDIRECT($A$5&ROW($A207)),'State Lookup'!$A:$B,2,FALSE),\"\")","v":""}]
[null,"",{"$f":"IFERROR(VLOOKUP(INDIRECT($A$5&ROW($A208)),'State Lookup'!$A:$B,2,FALSE),\"\")","v":""}]
[null,"",{"$f":"IFERROR(VLOOKUP(INDIRECT($A$5&ROW($A209)),'State Lookup'!$A:$B,2,FALSE),\"\")","v":""}]
[null,"",{"$f":"IFERROR(VLOOKUP(INDIRECT($A$5&ROW($A210)),'State Lookup'!$A:$B,2,FALSE),\"\")","v":""}]
[null,"",{"$f":"IFERROR(VLOOKUP(INDIRECT($A$5&ROW($A211)),'State Lookup'!$A:$B,2,FALSE),\"\")","v":""}]
[null,"",{"$f":"IFERROR(VLOOKUP(INDIRECT($A$5&ROW($A212)),'State Lookup'!$A:$B,2,FALSE),\"\")","v":""}]
[null,"",{"$f":"IFERROR(VLOOKUP(INDIRECT($A$5&ROW($A213)),'State Lookup'!$A:$B,2,FALSE),\"\")","v":""}]
[null,"",{"$f":"IFERROR(VLOOKUP(INDIRECT($A$5&ROW($A214)),'State Lookup'!$A:$B,2,FALSE),\"\")","v":""}]
[null,"",{"$f":"IFERROR(VLOOKUP(INDIRECT($A$5&ROW($A215)),'State Lookup'!$A:$B,2,FALSE),\"\")","v":""}]
[null,"",{"$f":"IFERROR(VLOOKUP(INDIRECT($A$5&ROW($A216)),'State Lookup'!$A:$B,2,FALSE),\"\")","v":""}]
[null,"",{"$f":"IFERROR(VLOOKUP(INDIRECT($A$5&ROW($A217)),'State Lookup'!$A:$B,2,FALSE),\"\")","v":""}]
[null,"",{"$f":"IFERROR(VLOOKUP(INDIRECT($A$5&ROW($A218)),'State Lookup'!$A:$B,2,FALSE),\"\")","v":""}]
[null,"",{"$f":"IFERROR(VLOOKUP(INDIRECT($A$5&ROW($A219)),'State Lookup'!$A:$B,2,FALSE),\"\")","v":""}]
[null,"",{"$f":"IFERROR(VLOOKUP(INDIRECT($A$5&ROW($A220)),'State Lookup'!$A:$B,2,FALSE),\"\")","v":""}]
[null,"",{"$f":"IFERROR(VLOOKUP(INDIRECT($A$5&ROW($A221)),'State Lookup'!$A:$B,2,FALSE),\"\")","v":""}]
[null,"",{"$f":"IFERROR(VLOOKUP(INDIRECT($A$5&ROW($A222)),'State Lookup'!$A:$B,2,FALSE),\"\")","v":""}]
[null,"",{"$f":"IFERROR(VLOOKUP(INDIRECT($A$5&ROW($A223)),'State Lookup'!$A:$B,2,FALSE),\"\")","v":""}]
[null,"",{"$f":"IFERROR(VLOOKUP(INDIRECT($A$5&ROW($A224)),'State Lookup'!$A:$B,2,FALSE),\"\")","v":""}]
[null,"",{"$f":"IFERROR(VLOOKUP(INDIRECT($A$5&ROW($A225)),'State Lookup'!$A:$B,2,FALSE),\"\")","v":""}]
[null,"",{"$f":"IFERROR(VLOOKUP(INDIRECT($A$5&ROW($A226)),'State Lookup'!$A:$B,2,FALSE),\"\")","v":""}]
[null,"",{"$f":"IFERROR(VLOOKUP(INDIRECT($A$5&ROW($A227)),'State Lookup'!$A:$B,2,FALSE),\"\")","v":""}]
[null,"",{"$f":"IFERROR(VLOOKUP(INDIRECT($A$5&ROW($A228)),'State Lookup'!$A:$B,2,FALSE),\"\")","v":""}]
[null,"",{"$f":"IFERROR(VLOOKUP(INDIRECT($A$5&ROW($A229)),'State Lookup'!$A:$B,2,FALSE),\"\")","v":""}]
[null,"",{"$f":"IFERROR(VLOOKUP(INDIRECT($A$5&ROW($A230)),'State Lookup'!$A:$B,2,FALSE),\"\")","v":""}]
[null,"",{"$f":"IFERROR(VLOOKUP(INDIRECT($A$5&ROW($A231)),'State Lookup'!$A:$B,2,FALSE),\"\")","v":""}]
[null,"",{"$f":"IFERROR(VLOOKUP(INDIRECT($A$5&ROW($A232)),'State Lookup'!$A:$B,2,FALSE),\"\")","v":""}]
[null,"",{"$f":"IFERROR(VLOOKUP(INDIRECT($A$5&ROW($A233)),'State Lookup'!$A:$B,2,FALSE),\"\")","v":""}]
[null,"",{"$f":"IFERROR(VLOOKUP(INDIRECT($A$5&ROW($A234)),'State Lookup'!$A:$B,2,FALSE),\"\")","v":""}]
[null,"",{"$f":"IFERROR(VLOOKUP(INDIRECT($A$5&ROW($A235)),'State Lookup'!$A:$B,2,FALSE),\"\")","v":""}]
[null,"",{"$f":"IFERROR(VLOOKUP(INDIRECT($A$5&ROW($A236)),'State Lookup'!$A:$B,2,FALSE),\"\")","v":""}]
[null,"",{"$f":"IFERROR(VLOOKUP(INDIRECT($A$5&ROW($A237)),'State Lookup'!$A:$B,2,FALSE),\"\")","v":""}]
[null,"",{"$f":"IFERROR(VLOOKUP(INDIRECT($A$5&ROW($A238)),'State Lookup'!$A:$B,2,FALSE),\"\")","v":""}]
[null,"",{"$f":"IFERROR(VLOOKUP(INDIRECT($A$5&ROW($A239)),'State Lookup'!$A:$B,2,FALSE),\"\")","v":""}]
[null,"",{"$f":"IFERROR(VLOOKUP(INDIRECT($A$5&ROW($A240)),'State Lookup'!$A:$B,2,FALSE),\"\")","v":""}]
[null,"",{"$f":"IFERROR(VLOOKUP(INDIRECT($A$5&ROW($A241)),'State Lookup'!$A:$B,2,FALSE),\"\")","v":""}]
[null,"",{"$f":"IFERROR(VLOOKUP(INDIRECT($A$5&ROW($A242)),'State Lookup'!$A:$B,2,FALSE),\"\")","v":""}]
[null,"",{"$f":"IFERROR(VLOOKUP(INDIRECT($A$5&ROW($A243)),'State Lookup'!$A:$B,2,FALSE),\"\")","v":""}]
[null,"",{"$f":"IFERROR(VLOOKUP(INDIRECT($A$5&ROW($A244)),'State Lookup'!$A:$B,2,FALSE),\"\")","v":""}]
[null,"",{"$f":"IFERROR(VLOOKUP(INDIRECT($A$5&ROW($A245)),'State Lookup'!$A:$B,2,FALSE),\"\")","v":""}]
[null,"",{"$f":"IFERROR(VLOOKUP(INDIRECT($A$5&ROW($A246)),'State Lookup'!$A:$B,2,FALSE),\"\")","v":""}]
[null,"",{"$f":"IFERROR(VLOOKUP(INDIRECT($A$5&ROW($A247)),'State Lookup'!$A:$B,2,FALSE),\"\")","v":""}]
[null,"",{"$f":"IFERROR(VLOOKUP(INDIRECT($A$5&ROW($A248)),'State Lookup'!$A:$B,2,FALSE),\"\")","v":""}]
[null,"",{"$f":"IFERROR(VLOOKUP(INDIRECT($A$5&ROW($A249)),'State Lookup'!$A:$B,2,FALSE),\"\")","v":""}]
[null,"",{"$f":"IFERROR(VLOOKUP(INDIRECT($A$5&ROW($A250)),'State Lookup'!$A:$B,2,FALSE),\"\")","v":""}]
[null,"",{"$f":"IFERROR(VLOOKUP(INDIRECT($A$5&ROW($A251)),'State Lookup'!$A:$B,2,FALSE),\"\")","v":""}]
[null,"",{"$f":"IFERROR(VLOOKUP(INDIRECT($A$5&ROW($A252)),'State Lookup'!$A:$B,2,FALSE),\"\")","v":""}]
[null,"",{"$f":"IFERROR(VLOOKUP(INDIRECT($A$5&ROW($A253)),'State Lookup'!$A:$B,2,FALSE),\"\")","v":""}]
[null,"",{"$f":"IFERROR(VLOOKUP(INDIRECT($A$5&ROW($A254)),'State Lookup'!$A:$B,2,FALSE),\"\")","v":""}]
[null,"",{"$f":"IFERROR(VLOOKUP(INDIRECT($A$5&ROW($A255)),'State Lookup'!$A:$B,2,FALSE),\"\")","v":""}]
[null,"",{"$f":"IFERROR(VLOOKUP(INDIRECT($A$5&ROW($A256)),'State Lookup'!$A:$B,2,FALSE),\"\")","v":""}]
[null,"",{"$f":"IFERROR(VLOOKUP(INDIRECT($A$5&ROW($A257)),'State Lookup'!$A:$B,2,FALSE),\"\")","v":""}]
[null,"",{"$f":"IFERROR(VLOOKUP(INDIRECT($A$5&ROW($A258)),'State Lookup'!$A:$B,2,FALSE),\"\")","v":""}]
[null,{"$f":"IFERROR((INDIRECT($A$3&ROW($A259))/INDIRECT($A$1&ROW($A259)))*100,\"\")","v":""},{"$f":"IFERROR(VLOOKUP(INDIRECT($A$5&ROW($A259)),'State Lookup'!$A:$B,2,FALSE),\"\")","v":""}]
[null,"",{"$f":"IFERROR(VLOOKUP(INDIRECT($A$5&ROW($A260)),'State Lookup'!$A:$B,2,FALSE),\"\")","v":""}]
[null,"",{"$f":"IFERROR(VLOOKUP(INDIRECT($A$5&ROW($A261)),'State Lookup'!$A:$B,2,FALSE),\"\")","v":""}]
[null,"",{"$f":"IFERROR(VLOOKUP(INDIRECT($A$5&ROW($A262)),'State Lookup'!$A:$B,2,FALSE),\"\")","v":""}]
[null,"",{"$f":"IFERROR(VLOOKUP(INDIRECT($A$5&ROW($A263)),'State Lookup'!$A:$B,2,FALSE),\"\")","v":""}]
[null,"",{"$f":"IFERROR(VLOOKUP(INDIRECT($A$5&ROW($A264)),'State Lookup'!$A:$B,2,FALSE),\"\")","v":""}]
[null,"",{"$f":"IFERROR(VLOOKUP(INDIRECT($A$5&ROW($A265)),'State Lookup'!$A:$B,2,FALSE),\"\")","v":""}]
[null,"",{"$f":"IFERROR(VLOOKUP(INDIRECT($A$5&ROW($A266)),'State Lookup'!$A:$B,2,FALSE),\"\")","v":""}]
[null,"",{"$f":"IFERROR(VLOOKUP(INDIRECT($A$5&ROW($A267)),'State Lookup'!$A:$B,2,FALSE),\"\")","v":""}]
[null,"",{"$f":"IFERROR(VLOOKUP(INDIRECT($A$5&ROW($A268)),'State Lookup'!$A:$B,2,FALSE),\"\")","v":""}]
[null,"",{"$f":"IFERROR(VLOOKUP(INDIRECT($A$5&ROW($A269)),'State Lookup'!$A:$B,2,FALSE),\"\")","v":""}]
[null,"",{"$f":"IFERROR(VLOOKUP(INDIRECT($A$5&ROW($A270)),'State Lookup'!$A:$B,2,FALSE),\"\")","v":""}]
[null,"",{"$f":"IFERROR(VLOOKUP(INDIRECT($A$5&ROW($A271)),'State Lookup'!$A:$B,2,FALSE),\"\")","v":""}]
[null,"",{"$f":"IFERROR(VLOOKUP(INDIRECT($A$5&ROW($A272)),'State Lookup'!$A:$B,2,FALSE),\"\")","v":""}]
[null,"",{"$f":"IFERROR(VLOOKUP(INDIRECT($A$5&ROW($A273)),'State Lookup'!$A:$B,2,FALSE),\"\")","v":""}]
[null,"",{"$f":"IFERROR(VLOOKUP(INDIRECT($A$5&ROW($A274)),'State Lookup'!$A:$B,2,FALSE),\"\")","v":""}]
[null,"",{"$f":"IFERROR(VLOOKUP(INDIRECT($A$5&ROW($A275)),'State Lookup'!$A:$B,2,FALSE),\"\")","v":""}]
[null,"",{"$f":"IFERROR(VLOOKUP(INDIRECT($A$5&ROW($A276)),'State Lookup'!$A:$B,2,FALSE),\"\")","v":""}]
[null,"",{"$f":"IFERROR(VLOOKUP(INDIRECT($A$5&ROW($A277)),'State Lookup'!$A:$B,2,FALSE),\"\")","v":""}]
[null,"",{"$f":"IFERROR(VLOOKUP(INDIRECT($A$5&ROW($A278)),'State Lookup'!$A:$B,2,FALSE),\"\")","v":""}]
[null,"",{"$f":"IFERROR(VLOOKUP(INDIRECT($A$5&ROW($A279)),'State Lookup'!$A:$B,2,FALSE),\"\")","v":""}]
[null,"",{"$f":"IFERROR(VLOOKUP(INDIRECT($A$5&ROW($A280)),'State Lookup'!$A:$B,2,FALSE),\"\")","v":""}]
[null,"",{"$f":"IFERROR(VLOOKUP(INDIRECT($A$5&ROW($A281)),'State Lookup'!$A:$B,2,FALSE),\"\")","v":""}]
[null,"",{"$f":"IFERROR(VLOOKUP(INDIRECT($A$5&ROW($A282)),'State Lookup'!$A:$B,2,FALSE),\"\")","v":""}]
[null,"",{"$f":"IFERROR(VLOOKUP(INDIRECT($A$5&ROW($A283)),'State Lookup'!$A:$B,2,FALSE),\"\")","v":""}]
[null,"",{"$f":"IFERROR(VLOOKUP(INDIRECT($A$5&ROW($A284)),'State Lookup'!$A:$B,2,FALSE),\"\")","v":""}]
[null,"",{"$f":"IFERROR(VLOOKUP(INDIRECT($A$5&ROW($A285)),'State Lookup'!$A:$B,2,FALSE),\"\")","v":""}]
[null,"",{"$f":"IFERROR(VLOOKUP(INDIRECT($A$5&ROW($A286)),'State Lookup'!$A:$B,2,FALSE),\"\")","v":""}]
[null,"",{"$f":"IFERROR(VLOOKUP(INDIRECT($A$5&ROW($A287)),'State Lookup'!$A:$B,2,FALSE),\"\")","v":""}]
[null,"",{"$f":"IFERROR(VLOOKUP(INDIRECT($A$5&ROW($A288)),'State Lookup'!$A:$B,2,FALSE),\"\")","v":""}]
[null,"",{"$f":"IFERROR(VLOOKUP(INDIRECT($A$5&ROW($A289)),'State Lookup'!$A:$B,2,FALSE),\"\")","v":""}]
[null,"",{"$f":"IFERROR(VLOOKUP(INDIRECT($A$5&ROW($A290)),'State Lookup'!$A:$B,2,FALSE),\"\")","v":""}]
[null,"",{"$f":"IFERROR(VLOOKUP(INDIRECT($A$5&ROW($A291)),'State Lookup'!$A:$B,2,FALSE),\"\")","v":""}]
[null,"",{"$f":"IFERROR(VLOOKUP(INDIRECT($A$5&ROW($A292)),'State Lookup'!$A:$B,2,FALSE),\"\")","v":""}]
[null,"",{"$f":"IFERROR(VLOOKUP(INDIRECT($A$5&ROW($A293)),'State Lookup'!$A:$B,2,FALSE),\"\")","v":""}]
[null,"",{"$f":"IFERROR(VLOOKUP(INDIRECT($A$5&ROW($A294)),'State Lookup'!$A:$B,2,FALSE),\"\")","v":""}]
[null,"",{"$f":"IFERROR(VLOOKUP(INDIRECT($A$5&ROW($A295)),'State Lookup'!$A:$B,2,FALSE),\"\")","v":""}]
[null,"",{"$f":"IFERROR(VLOOKUP(INDIRECT($A$5&ROW($A296)),'State Lookup'!$A:$B,2,FALSE),\"\")","v":""}]
[null,"",{"$f":"IFERROR(VLOOKUP(INDIRECT($A$5&ROW($A297)),'State Lookup'!$A:$B,2,FALSE),\"\")","v":""}]
[null,"",{"$f":"IFERROR(VLOOKUP(INDIRECT($A$5&ROW($A298)),'State Lookup'!$A:$B,2,FALSE),\"\")","v":""}]
[null,"",{"$f":"IFERROR(VLOOKUP(INDIRECT($A$5&ROW($A299)),'State Lookup'!$A:$B,2,FALSE),\"\")","v":""}]
[null,"",{"$f":"IFERROR(VLOOKUP(INDIRECT($A$5&ROW($A300)),'State Lookup'!$A:$B,2,FALSE),\"\")","v":""}]
[null,"",{"$f":"IFERROR(VLOOKUP(INDIRECT($A$5&ROW($A301)),'State Lookup'!$A:$B,2,FALSE),\"\")","v":""}]
[null,"",{"$f":"IFERROR(VLOOKUP(INDIRECT($A$5&ROW($A302)),'State Lookup'!$A:$B,2,FALSE),\"\")","v":""}]
[null,"",{"$f":"IFERROR(VLOOKUP(INDIRECT($A$5&ROW($A303)),'State Lookup'!$A:$B,2,FALSE),\"\")","v":""}]
[null,"",{"$f":"IFERROR(VLOOKUP(INDIRECT($A$5&ROW($A304)),'State Lookup'!$A:$B,2,FALSE),\"\")","v":""}]
[null,"",{"$f":"IFERROR(VLOOKUP(INDIRECT($A$5&ROW($A305)),'State Lookup'!$A:$B,2,FALSE),\"\")","v":""}]
[null,"",{"$f":"IFERROR(VLOOKUP(INDIRECT($A$5&ROW($A306)),'State Lookup'!$A:$B,2,FALSE),\"\")","v":""}]
[null,"",{"$f":"IFERROR(VLOOKUP(INDIRECT($A$5&ROW($A307)),'State Lookup'!$A:$B,2,FALSE),\"\")","v":""}]
[null,"",{"$f":"IFERROR(VLOOKUP(INDIRECT($A$5&ROW($A308)),'State Lookup'!$A:$B,2,FALSE),\"\")","v":""}]
[null,"",{"$f":"IFERROR(VLOOKUP(INDIRECT($A$5&ROW($A309)),'State Lookup'!$A:$B,2,FALSE),\"\")","v":""}]
[null,"",{"$f":"IFERROR(VLOOKUP(INDIRECT($A$5&ROW($A310)),'State Lookup'!$A:$B,2,FALSE),\"\")","v":""}]
[null,"",{"$f":"IFERROR(VLOOKUP(INDIRECT($A$5&ROW($A311)),'State Lookup'!$A:$B,2,FALSE),\"\")","v":""}]
[null,"",{"$f":"IFERROR(VLOOKUP(INDIRECT($A$5&ROW($A312)),'State Lookup'!$A:$B,2,FALSE),\"\")","v":""}]
[null,"",{"$f":"IFERROR(VLOOKUP(INDIRECT($A$5&ROW($A313)),'State Lookup'!$A:$B,2,FALSE),\"\")","v":""}]
[null,"",{"$f":"IFERROR(VLOOKUP(INDIRECT($A$5&ROW($A314)),'State Lookup'!$A:$B,2,FALSE),\"\")","v":""}]
[null,"",{"$f":"IFERROR(VLOOKUP(INDIRECT($A$5&ROW($A315)),'State Lookup'!$A:$B,2,FALSE),\"\")","v":""}]
[null,"",{"$f":"IFERROR(VLOOKUP(INDIRECT($A$5&ROW($A316)),'State Lookup'!$A:$B,2,FALSE),\"\")","v":""}]
[null,"",{"$f":"IFERROR(VLOOKUP(INDIRECT($A$5&ROW($A317)),'State Lookup'!$A:$B,2,FALSE),\"\")","v":""}]
[null,"",{"$f":"IFERROR(VLOOKUP(INDIRECT($A$5&ROW($A318)),'State Lookup'!$A:$B,2,FALSE),\"\")","v":""}]
[null,"",{"$f":"IFERROR(VLOOKUP(INDIRECT($A$5&ROW($A319)),'State Lookup'!$A:$B,2,FALSE),\"\")","v":""}]
[null,"",{"$f":"IFERROR(VLOOKUP(INDIRECT($A$5&ROW($A320)),'State Lookup'!$A:$B,2,FALSE),\"\")","v":""}]
[null,"",{"$f":"IFERROR(VLOOKUP(INDIRECT($A$5&ROW($A321)),'State Lookup'!$A:$B,2,FALSE),\"\")","v":""}]
[null,"",{"$f":"IFERROR(VLOOKUP(INDIRECT($A$5&ROW($A322)),'State Lookup'!$A:$B,2,FALSE),\"\")","v":""}]
[null,{"$f":"IFERROR((INDIRECT($A$3&ROW($A323))/INDIRECT($A$1&ROW($A323)))*100,\"\")","v":""},{"$f":"IFERROR(VLOOKUP(INDIRECT($A$5&ROW($A323)),'State Lookup'!$A:$B,2,FALSE),\"\")","v":""}]
[null,"",{"$f":"IFERROR(VLOOKUP(INDIRECT($A$5&ROW($A324)),'State Lookup'!$A:$B,2,FALSE),\"\")","v":""}]
[null,"",{"$f":"IFERROR(VLOOKUP(INDIRECT($A$5&ROW($A325)),'State Lookup'!$A:$B,2,FALSE),\"\")","v":""}]
[null,"",{"$f":"IFERROR(VLOOKUP(INDIRECT($A$5&ROW($A326)),'State Lookup'!$A:$B,2,FALSE),\"\")","v":""}]
[null,"",{"$f":"IFERROR(VLOOKUP(INDIRECT($A$5&ROW($A327)),'State Lookup'!$A:$B,2,FALSE),\"\")","v":""}]
[null,"",{"$f":"IFERROR(VLOOKUP(INDIRECT($A$5&ROW($A328)),'State Lookup'!$A:$B,2,FALSE),\"\")","v":""}]
[null,"",{"$f":"IFERROR(VLOOKUP(INDIRECT($A$5&ROW($A329)),'State Lookup'!$A:$B,2,FALSE),\"\")","v":""}]
[null,"",{"$f":"IFERROR(VLOOKUP(INDIRECT($A$5&ROW($A330)),'State Lookup'!$A:$B,2,FALSE),\"\")","v":""}]
[null,"",{"$f":"IFERROR(VLOOKUP(INDIRECT($A$5&ROW($A331)),'State Lookup'!$A:$B,2,FALSE),\"\")","v":""}]
[null,"",{"$f":"IFERROR(VLOOKUP(INDIRECT($A$5&ROW($A332)),'State Lookup'!$A:$B,2,FALSE),\"\")","v":""}]
[null,"",{"$f":"IFERROR(VLOOKUP(INDIRECT($A$5&ROW($A333)),'State Lookup'!$A:$B,2,FALSE),\"\")","v":""}]
[null,"",{"$f":"IFERROR(VLOOKUP(INDIRECT($A$5&ROW($A334)),'State Lookup'!$A:$B,2,FALSE),\"\")","v":""}]
[null,"",{"$f":"IFERROR(VLOOKUP(INDIRECT($A$5&ROW($A335)),'State Lookup'!$A:$B,2,FALSE),\"\")","v":""}]
[null,"",{"$f":"IFERROR(VLOOKUP(INDIRECT($A$5&ROW($A336)),'State Lookup'!$A:$B,2,FALSE),\"\")","v":""}]
[null,"",{"$f":"IFERROR(VLOOKUP(INDIRECT($A$5&ROW($A337)),'State Lookup'!$A:$B,2,FALSE),\"\")","v":""}]
[null,"",{"$f":"IFERROR(VLOOKUP(INDIRECT($A$5&ROW($A338)),'State Lookup'!$A:$B,2,FALSE),\"\")","v":""}]
[null,"",{"$f":"IFERROR(VLOOKUP(INDIRECT($A$5&ROW($A339)),'State Lookup'!$A:$B,2,FALSE),\"\")","v":""}]
[null,"",{"$f":"IFERROR(VLOOKUP(INDIRECT($A$5&ROW($A340)),'State Lookup'!$A:$B,2,FALSE),\"\")","v":""}]
[null,"",{"$f":"IFERROR(VLOOKUP(INDIRECT($A$5&ROW($A341)),'State Lookup'!$A:$B,2,FALSE),\"\")","v":""}]
[null,"",{"$f":"IFERROR(VLOOKUP(INDIRECT($A$5&ROW($A342)),'State Lookup'!$A:$B,2,FALSE),\"\")","v":""}]
[null,"",{"$f":"IFERROR(VLOOKUP(INDIRECT($A$5&ROW($A343)),'State Lookup'!$A:$B,2,FALSE),\"\")","v":""}]
[null,"",{"$f":"IFERROR(VLOOKUP(INDIRECT($A$5&ROW($A344)),'State Lookup'!$A:$B,2,FALSE),\"\")","v":""}]
[null,"",{"$f":"IFERROR(VLOOKUP(INDIRECT($A$5&ROW($A345)),'State Lookup'!$A:$B,2,FALSE),\"\")","v":""}]
[null,"",{"$f":"IFERROR(VLOOKUP(INDIRECT($A$5&ROW($A346)),'State Lookup'!$A:$B,2,FALSE),\"\")","v":""}]
[null,"",{"$f":"IFERROR(VLOOKUP(INDIRECT($A$5&ROW($A347)),'State Lookup'!$A:$B,2,FALSE),\"\")","v":""}]
[null,"",{"$f":"IFERROR(VLOOKUP(INDIRECT($A$5&ROW($A348)),'State Lookup'!$A:$B,2,FALSE),\"\")","v":""}]
[null,"",{"$f":"IFERROR(VLOOKUP(INDIRECT($A$5&ROW($A349)),'State Lookup'!$A:$B,2,FALSE),\"\")","v":""}]
[null,"",{"$f":"IFERROR(VLOOKUP(INDIRECT($A$5&ROW($A350)),'State Lookup'!$A:$B,2,FALSE),\"\")","v":""}]
[null,"",{"$f":"IFERROR(VLOOKUP(INDIRECT($A$5&ROW($A351)),'State Lookup'!$A:$B,2,FALSE),\"\")","v":""}]
[null,"",{"$f":"IFERROR(VLOOKUP(INDIRECT($A$5&ROW($A352)),'State Lookup'!$A:$B,2,FALSE),\"\")","v":""}]
[null,"",{"$f":"IFERROR(VLOOKUP(INDIRECT($A$5&ROW($A353)),'State Lookup'!$A:$B,2,FALSE),\"\")","v":""}]
[null,"",{"$f":"IFERROR(VLOOKUP(INDIRECT($A$5&ROW($A354)),'State Lookup'!$A:$B,2,FALSE),\"\")","v":""}]
[null,"",{"$f":"IFERROR(VLOOKUP(INDIRECT($A$5&ROW($A355)),'State Lookup'!$A:$B,2,FALSE),\"\")","v":""}]
[null,"",{"$f":"IFERROR(VLOOKUP(INDIRECT($A$5&ROW($A356)),'State Lookup'!$A:$B,2,FALSE),\"\")","v":""}]
[null,"",{"$f":"IFERROR(VLOOKUP(INDIRECT($A$5&ROW($A357)),'State Lookup'!$A:$B,2,FALSE),\"\")","v":""}]
[null,"",{"$f":"IFERROR(VLOOKUP(INDIRECT($A$5&ROW($A358)),'State Lookup'!$A:$B,2,FALSE),\"\")","v":""}]
[null,"",{"$f":"IFERROR(VLOOKUP(INDIRECT($A$5&ROW($A359)),'State Lookup'!$A:$B,2,FALSE),\"\")","v":""}]
[null,"",{"$f":"IFERROR(VLOOKUP(INDIRECT($A$5&ROW($A360)),'State Lookup'!$A:$B,2,FALSE),\"\")","v":""}]
[null,"",{"$f":"IFERROR(VLOOKUP(INDIRECT($A$5&ROW($A361)),'State Lookup'!$A:$B,2,FALSE),\"\")","v":""}]
[null,"",{"$f":"IFERROR(VLOOKUP(INDIRECT($A$5&ROW($A362)),'State Lookup'!$A:$B,2,FALSE),\"\")","v":""}]
[null,"",{"$f":"IFERROR(VLOOKUP(INDIRECT($A$5&ROW($A363)),'State Lookup'!$A:$B,2,FALSE),\"\")","v":""}]
[null,"",{"$f":"IFERROR(VLOOKUP(INDIRECT($A$5&ROW($A364)),'State Lookup'!$A:$B,2,FALSE),\"\")","v":""}]
[null,"",{"$f":"IFERROR(VLOOKUP(INDIRECT($A$5&ROW($A365)),'State Lookup'!$A:$B,2,FALSE),\"\")","v":""}]
[null,"",{"$f":"IFERROR(VLOOKUP(INDIRECT($A$5&ROW($A366)),'State Lookup'!$A:$B,2,FALSE),\"\")","v":""}]
[null,"",{"$f":"IFERROR(VLOOKUP(INDIRECT($A$5&ROW($A367)),'State Lookup'!$A:$B,2,FALSE),\"\")","v":""}]
[null,"",{"$f":"IFERROR(VLOOKUP(INDIRECT($A$5&ROW($A368)),'State Lookup'!$A:$B,2,FALSE),\"\")","v":""}]
[null,"",{"$f":"IFERROR(VLOOKUP(INDIRECT($A$5&ROW($A369)),'State Lookup'!$A:$B,2,FALSE),\"\")","v":""}]
[null,"",{"$f":"IFERROR(VLOOKUP(INDIRECT($A$5&ROW($A370)),'State Lookup'!$A:$B,2,FALSE),\"\")","v":""}]
[null,"",{"$f":"IFERROR(VLOOKUP(INDIRECT($A$5&ROW($A371)),'State Lookup'!$A:$B,2,FALSE),\"\")","v":""}]
[null,"",{"$f":"IFERROR(VLOOKUP(INDIRECT($A$5&ROW($A372)),'State Lookup'!$A:$B,2,FALSE),\"\")","v":""}]
[null,"",{"$f":"IFERROR(VLOOKUP(INDIRECT($A$5&ROW($A373)),'State Lookup'!$A:$B,2,FALSE),\"\")","v":""}]
[null,"",{"$f":"IFERROR(VLOOKUP(INDIRECT($A$5&ROW($A374)),'State Lookup'!$A:$B,2,FALSE),\"\")","v":""}]
[null,"",{"$f":"IFERROR(VLOOKUP(INDIRECT($A$5&ROW($A375)),'State Lookup'!$A:$B,2,FALSE),\"\")","v":""}]
[null,"",{"$f":"IFERROR(VLOOKUP(INDIRECT($A$5&ROW($A376)),'State Lookup'!$A:$B,2,FALSE),\"\")","v":""}]
[null,"",{"$f":"IFERROR(VLOOKUP(INDIRECT($A$5&ROW($A377)),'State Lookup'!$A:$B,2,FALSE),\"\")","v":""}]
[null,"",{"$f":"IFERROR(VLOOKUP(INDIRECT($A$5&ROW($A378)),'State Lookup'!$A:$B,2,FALSE),\"\")","v":""}]
[null,"",{"$f":"IFERROR(VLOOKUP(INDIRECT($A$5&ROW($A379)),'State Lookup'!$A:$B,2,FALSE),\"\")","v":""}]
[null,"",{"$f":"IFERROR(VLOOKUP(INDIRECT($A$5&ROW($A380)),'State Lookup'!$A:$B,2,FALSE),\"\")","v":""}]
[null,"",{"$f":"IFERROR(VLOOKUP(INDIRECT($A$5&ROW($A381)),'State Lookup'!$A:$B,2,FALSE),\"\")","v":""}]
[null,"",{"$f":"IFERROR(VLOOKUP(INDIRECT($A$5&ROW($A382)),'State Lookup'!$A:$B,2,FALSE),\"\")","v":""}]
[null,"",{"$f":"IFERROR(VLOOKUP(INDIRECT($A$5&ROW($A383)),'State Lookup'!$A:$B,2,FALSE),\"\")","v":""}]
[null,"",{"$f":"IFERROR(VLOOKUP(INDIRECT($A$5&ROW($A384)),'State Lookup'!$A:$B,2,FALSE),\"\")","v":""}]
[null,"",{"$f":"IFERROR(VLOOKUP(INDIRECT($A$5&ROW($A385)),'State Lookup'!$A:$B,2,FALSE),\"\")","v":""}]
[null,"",{"$f":"IFERROR(VLOOKUP(INDIRECT($A$5&ROW($A386)),'State Lookup'!$A:$B,2,FALSE),\"\")","v":""}]
[null,{"$f":"IFERROR((INDIRECT($A$3&ROW($A387))/INDIRECT($A$1&ROW($A387)))*100,\"\")","v":""},{"$f":"IFERROR(VLOOKUP(INDIRECT($A$5&ROW($A387)),'State Lookup'!$A:$B,2,FALSE),\"\")","v":""}]
[null,"",{"$f":"IFERROR(VLOOKUP(INDIRECT($A$5&ROW($A388)),'State Lookup'!$A:$B,2,FALSE),\"\")","v":""}]
[null,"",{"$f":"IFERROR(VLOOKUP(INDIRECT($A$5&ROW($A389)),'State Lookup'!$A:$B,2,FALSE),\"\")","v":""}]
[null,"",{"$f":"IFERROR(VLOOKUP(INDIRECT($A$5&ROW($A390)),'State Lookup'!$A:$B,2,FALSE),\"\")","v":""}]
[null,"",{"$f":"IFERROR(VLOOKUP(INDIRECT($A$5&ROW($A391)),'State Lookup'!$A:$B,2,FALSE),\"\")","v":""}]
[null,"",{"$f":"IFERROR(VLOOKUP(INDIRECT($A$5&ROW($A392)),'State Lookup'!$A:$B,2,FALSE),\"\")","v":""}]
[null,"",{"$f":"IFERROR(VLOOKUP(INDIRECT($A$5&ROW($A393)),'State Lookup'!$A:$B,2,FALSE),\"\")","v":""}]
[null,"",{"$f":"IFERROR(VLOOKUP(INDIRECT($A$5&ROW($A394)),'State Lookup'!$A:$B,2,FALSE),\"\")","v":""}]
[null,"",{"$f":"IFERROR(VLOOKUP(INDIRECT($A$5&ROW($A395)),'State Lookup'!$A:$B,2,FALSE),\"\")","v":""}]
[null,"",{"$f":"IFERROR(VLOOKUP(INDIRECT($A$5&ROW($A396)),'State Lookup'!$A:$B,2,FALSE),\"\")","v":""}]
[null,"",{"$f":"IFERROR(VLOOKUP(INDIRECT($A$5&ROW($A397)),'State Lookup'!$A:$B,2,FALSE),\"\")","v":""}]
[null,"",{"$f":"IFERROR(VLOOKUP(INDIRECT($A$5&ROW($A398)),'State Lookup'!$A:$B,2,FALSE),\"\")","v":""}]
[null,"",{"$f":"IFERROR(VLOOKUP(INDIRECT($A$5&ROW($A399)),'State Lookup'!$A:$B,2,FALSE),\"\")","v":""}]
[null,"",{"$f":"IFERROR(VLOOKUP(INDIRECT($A$5&ROW($A400)),'State Lookup'!$A:$B,2,FALSE),\"\")","v":""}]
[null,"",{"$f":"IFERROR(VLOOKUP(INDIRECT($A$5&ROW($A401)),'State Lookup'!$A:$B,2,FALSE),\"\")","v":""}]
[null,"",{"$f":"IFERROR(VLOOKUP(INDIRECT($A$5&ROW($A402)),'State Lookup'!$A:$B,2,FALSE),\"\")","v":""}]
[null,"",{"$f":"IFERROR(VLOOKUP(INDIRECT($A$5&ROW($A403)),'State Lookup'!$A:$B,2,FALSE),\"\")","v":""}]
[null,"",{"$f":"IFERROR(VLOOKUP(INDIRECT($A$5&ROW($A404)),'State Lookup'!$A:$B,2,FALSE),\"\")","v":""}]
[null,"",{"$f":"IFERROR(VLOOKUP(INDIRECT($A$5&ROW($A405)),'State Lookup'!$A:$B,2,FALSE),\"\")","v":""}]
[null,"",{"$f":"IFERROR(VLOOKUP(INDIRECT($A$5&ROW($A406)),'State Lookup'!$A:$B,2,FALSE),\"\")","v":""}]
[null,"",{"$f":"IFERROR(VLOOKUP(INDIRECT($A$5&ROW($A407)),'State Lookup'!$A:$B,2,FALSE),\"\")","v":""}]
[null,"",{"$f":"IFERROR(VLOOKUP(INDIRECT($A$5&ROW($A408)),'State Lookup'!$A:$B,2,FALSE),\"\")","v":""}]
[null,"",{"$f":"IFERROR(VLOOKUP(INDIRECT($A$5&ROW($A409)),'State Lookup'!$A:$B,2,FALSE),\"\")","v":""}]
[null,"",{"$f":"IFERROR(VLOOKUP(INDIRECT($A$5&ROW($A410)),'State Lookup'!$A:$B,2,FALSE),\"\")","v":""}]
[null,"",{"$f":"IFERROR(VLOOKUP(INDIRECT($A$5&ROW($A411)),'State Lookup'!$A:$B,2,FALSE),\"\")","v":""}]
[null,"",{"$f":"IFERROR(VLOOKUP(INDIRECT($A$5&ROW($A412)),'State Lookup'!$A:$B,2,FALSE),\"\")","v":""}]
[null,"",{"$f":"IFERROR(VLOOKUP(INDIRECT($A$5&ROW($A413)),'State Lookup'!$A:$B,2,FALSE),\"\")","v":""}]
[null,"",{"$f":"IFERROR(VLOOKUP(INDIRECT($A$5&ROW($A414)),'State Lookup'!$A:$B,2,FALSE),\"\")","v":""}]
[null,"",{"$f":"IFERROR(VLOOKUP(INDIRECT($A$5&ROW($A415)),'State Lookup'!$A:$B,2,FALSE),\"\")","v":""}]
[null,"",{"$f":"IFERROR(VLOOKUP(INDIRECT($A$5&ROW($A416)),'State Lookup'!$A:$B,2,FALSE),\"\")","v":""}]
[null,"",{"$f":"IFERROR(VLOOKUP(INDIRECT($A$5&ROW($A417)),'State Lookup'!$A:$B,2,FALSE),\"\")","v":""}]
[null,"",{"$f":"IFERROR(VLOOKUP(INDIRECT($A$5&ROW($A418)),'State Lookup'!$A:$B,2,FALSE),\"\")","v":""}]
[null,"",{"$f":"IFERROR(VLOOKUP(INDIRECT($A$5&ROW($A419)),'State Lookup'!$A:$B,2,FALSE),\"\")","v":""}]
[null,"",{"$f":"IFERROR(VLOOKUP(INDIRECT($A$5&ROW($A420)),'State Lookup'!$A:$B,2,FALSE),\"\")","v":""}]
[null,"",{"$f":"IFERROR(VLOOKUP(INDIRECT($A$5&ROW($A421)),'State Lookup'!$A:$B,2,FALSE),\"\")","v":""}]
[null,"",{"$f":"IFERROR(VLOOKUP(INDIRECT($A$5&ROW($A422)),'State Lookup'!$A:$B,2,FALSE),\"\")","v":""}]
[null,"",{"$f":"IFERROR(VLOOKUP(INDIRECT($A$5&ROW($A423)),'State Lookup'!$A:$B,2,FALSE),\"\")","v":""}]
[null,"",{"$f":"IFERROR(VLOOKUP(INDIRECT($A$5&ROW($A424)),'State Lookup'!$A:$B,2,FALSE),\"\")","v":""}]
[null,"",{"$f":"IFERROR(VLOOKUP(INDIRECT($A$5&ROW($A425)),'State Lookup'!$A:$B,2,FALSE),\"\")","v":""}]
[null,"",{"$f":"IFERROR(VLOOKUP(INDIRECT($A$5&ROW($A426)),'State Lookup'!$A:$B,2,FALSE),\"\")","v":""}]
[null,"",{"$f":"IFERROR(VLOOKUP(INDIRECT($A$5&ROW($A427)),'State Lookup'!$A:$B,2,FALSE),\"\")","v":""}]
[null,"",{"$f":"IFERROR(VLOOKUP(INDIRECT($A$5&ROW($A428)),'State Lookup'!$A:$B,2,FALSE),\"\")","v":""}]
[null,"",{"$f":"IFERROR(VLOOKUP(INDIRECT($A$5&ROW($A429)),'State Lookup'!$A:$B,2,FALSE),\"\")","v":""}]
[null,"",{"$f":"IFERROR(VLOOKUP(INDIRECT($A$5&ROW($A430)),'State Lookup'!$A:$B,2,FALSE),\"\")","v":""}]
[null,"",{"$f":"IFERROR(VLOOKUP(INDIRECT($A$5&ROW($A431)),'State Lookup'!$A:$B,2,FALSE),\"\")","v":""}]
[null,"",{"$f":"IFERROR(VLOOKUP(INDIRECT($A$5&ROW($A432)),'State Lookup'!$A:$B,2,FALSE),\"\")","v":""}]
[null,"",{"$f":"IFERROR(VLOOKUP(INDIRECT($A$5&ROW($A433)),'State Lookup'!$A:$B,2,FALSE),\"\")","v":""}]
[null,"",{"$f":"IFERROR(VLOOKUP(INDIRECT($A$5&ROW($A434)),'State Lookup'!$A:$B,2,FALSE),\"\")","v":""}]
[null,"",{"$f":"IFERROR(VLOOKUP(INDIRECT($A$5&ROW($A435)),'State Lookup'!$A:$B,2,FALSE),\"\")","v":""}]
[null,"",{"$f":"IFERROR(VLOOKUP(INDIRECT($A$5&ROW($A436)),'State Lookup'!$A:$B,2,FALSE),\"\")","v":""}]
[null,"",{"$f":"IFERROR(VLOOKUP(INDIRECT($A$5&ROW($A437)),'State Lookup'!$A:$B,2,FALSE),\"\")","v":""}]
[null,"",{"$f":"IFERROR(VLOOKUP(INDIRECT($A$5&ROW($A438)),'State Lookup'!$A:$B,2,FALSE),\"\")","v":""}]
[null,"",{"$f":"IFERROR(VLOOKUP(INDIRECT($A$5&ROW($A439)),'State Lookup'!$A:$B,2,FALSE),\"\")","v":""}]
[null,"",{"$f":"IFERROR(VLOOKUP(INDIRECT($A$5&ROW($A440)),'State Lookup'!$A:$B,2,FALSE),\"\")","v":""}]
[null,"",{"$f":"IFERROR(VLOOKUP(INDIRECT($A$5&ROW($A441)),'State Lookup'!$A:$B,2,FALSE),\"\")","v":""}]
[null,"",{"$f":"IFERROR(VLOOKUP(INDIRECT($A$5&ROW($A442)),'State Lookup'!$A:$B,2,FALSE),\"\")","v":""}]
[null,"",{"$f":"IFERROR(VLOOKUP(INDIRECT($A$5&ROW($A443)),'State Lookup'!$A:$B,2,FALSE),\"\")","v":""}]
[null,"",{"$f":"IFERROR(VLOOKUP(INDIRECT($A$5&ROW($A444)),'State Lookup'!$A:$B,2,FALSE),\"\")","v":""}]
[null,"",{"$f":"IFERROR(VLOOKUP(INDIRECT($A$5&ROW($A445)),'State Lookup'!$A:$B,2,FALSE),\"\")","v":""}]
[null,"",{"$f":"IFERROR(VLOOKUP(INDIRECT($A$5&ROW($A446)),'State Lookup'!$A:$B,2,FALSE),\"\")","v":""}]
[null,"",{"$f":"IFERROR(VLOOKUP(INDIRECT($A$5&ROW($A447)),'State Lookup'!$A:$B,2,FALSE),\"\")","v":""}]
[null,"",{"$f":"IFERROR(VLOOKUP(INDIRECT($A$5&ROW($A448)),'State Lookup'!$A:$B,2,FALSE),\"\")","v":""}]
[null,"",{"$f":"IFERROR(VLOOKUP(INDIRECT($A$5&ROW($A449)),'State Lookup'!$A:$B,2,FALSE),\"\")","v":""}]
[null,"",{"$f":"IFERROR(VLOOKUP(INDIRECT($A$5&ROW($A450)),'State Lookup'!$A:$B,2,FALSE),\"\")","v":""}]
[null,{"$f":"IFERROR((INDIRECT($A$3&ROW($A451))/INDIRECT($A$1&ROW($A451)))*100,\"\")","v":""},{"$f":"IFERROR(VLOOKUP(INDIRECT($A$5&ROW($A451)),'State Lookup'!$A:$B,2,FALSE),\"\")","v":""}]
[null,"",{"$f":"IFERROR(VLOOKUP(INDIRECT($A$5&ROW($A452)),'State Lookup'!$A:$B,2,FALSE),\"\")","v":""}]
[null,"",{"$f":"IFERROR(VLOOKUP(INDIRECT($A$5&ROW($A453)),'State Lookup'!$A:$B,2,FALSE),\"\")","v":""}]
[null,"",{"$f":"IFERROR(VLOOKUP(INDIRECT($A$5&ROW($A454)),'State Lookup'!$A:$B,2,FALSE),\"\")","v":""}]
[null,"",{"$f":"IFERROR(VLOOKUP(INDIRECT($A$5&ROW($A455)),'State Lookup'!$A:$B,2,FALSE),\"\")","v":""}]
[null,"",{"$f":"IFERROR(VLOOKUP(INDIRECT($A$5&ROW($A456)),'State Lookup'!$A:$B,2,FALSE),\"\")","v":""}]
[null,"",{"$f":"IFERROR(VLOOKUP(INDIRECT($A$5&ROW($A457)),'State Lookup'!$A:$B,2,FALSE),\"\")","v":""}]
[null,"",{"$f":"IFERROR(VLOOKUP(INDIRECT($A$5&ROW($A458)),'State Lookup'!$A:$B,2,FALSE),\"\")","v":""}]
[null,"",{"$f":"IFERROR(VLOOKUP(INDIRECT($A$5&ROW($A459)),'State Lookup'!$A:$B,2,FALSE),\"\")","v":""}]
[null,"",{"$f":"IFERROR(VLOOKUP(INDIRECT($A$5&ROW($A460)),'State Lookup'!$A:$B,2,FALSE),\"\")","v":""}]
[null,"",{"$f":"IFERROR(VLOOKUP(INDIRECT($A$5&ROW($A461)),'State Lookup'!$A:$B,2,FALSE),\"\")","v":""}]
[null,"",{"$f":"IFERROR(VLOOKUP(INDIRECT($A$5&ROW($A462)),'State Lookup'!$A:$B,2,FALSE),\"\")","v":""}]
[null,"",{"$f":"IFERROR(VLOOKUP(INDIRECT($A$5&ROW($A463)),'State Lookup'!$A:$B,2,FALSE),\"\")","v":""}]
[null,"",{"$f":"IFERROR(VLOOKUP(INDIRECT($A$5&ROW($A464)),'State Lookup'!$A:$B,2,FALSE),\"\")","v":""}]
[null,"",{"$f":"IFERROR(VLOOKUP(INDIRECT($A$5&ROW($A465)),'State Lookup'!$A:$B,2,FALSE),\"\")","v":""}]
[null,"",{"$f":"IFERROR(VLOOKUP(INDIRECT($A$5&ROW($A466)),'State Lookup'!$A:$B,2,FALSE),\"\")","v":""}]
[null,"",{"$f":"IFERROR(VLOOKUP(INDIRECT($A$5&ROW($A467)),'State Lookup'!$A:$B,2,FALSE),\"\")","v":""}]
[null,"",{"$f":"IFERROR(VLOOKUP(INDIRECT($A$5&ROW($A468)),'State Lookup'!$A:$B,2,FALSE),\"\")","v":""}]
[null,"",{"$f":"IFERROR(VLOOKUP(INDIRECT($A$5&ROW($A469)),'State Lookup'!$A:$B,2,FALSE),\"\")","v":""}]
[null,"",{"$f":"IFERROR(VLOOKUP(INDIRECT($A$5&ROW($A470)),'State Lookup'!$A:$B,2,FALSE),\"\")","v":""}]
[null,"",{"$f":"IFERROR(VLOOKUP(INDIRECT($A$5&ROW($A471)),'State Lookup'!$A:$B,2,FALSE),\"\")","v":""}]
[null,"",{"$f":"IFERROR(VLOOKUP(INDIRECT($A$5&ROW($A472)),'State Lookup'!$A:$B,2,FALSE),\"\")","v":""}]
[null,"",{"$f":"IFERROR(VLOOKUP(INDIRECT($A$5&ROW($A473)),'State Lookup'!$A:$B,2,FALSE),\"\")","v":""}]
[null,"",{"$f":"IFERROR(VLOOKUP(INDIRECT($A$5&ROW($A474)),'State Lookup'!$A:$B,2,FALSE),\"\")","v":""}]
[null,"",{"$f":"IFERROR(VLOOKUP(INDIRECT($A$5&ROW($A475)),'State Lookup'!$A:$B,2,FALSE),\"\")","v":""}]
[null,"",{"$f":"IFERROR(VLOOKUP(INDIRECT($A$5&ROW($A476)),'State Lookup'!$A:$B,2,FALSE),\"\")","v":""}]
[null,"",{"$f":"IFERROR(VLOOKUP(INDIRECT($A$5&ROW($A477)),'State Lookup'!$A:$B,2,FALSE),\"\")","v":""}]
[null,"",{"$f":"IFERROR(VLOOKUP(INDIRECT($A$5&ROW($A478)),'State Lookup'!$A:$B,2,FALSE),\"\")","v":""}]
[null,"",{"$f":"IFERROR(VLOOKUP(INDIRECT($A$5&ROW($A479)),'State Lookup'!$A:$B,2,FALSE),\"\")","v":""}]
[null,"",{"$f":"IFERROR(VLOOKUP(INDIRECT($A$5&ROW($A480)),'State Lookup'!$A:$B,2,FALSE),\"\")","v":""}]
[null,"",{"$f":"IFERROR(VLOOKUP(INDIRECT($A$5&ROW($A481)),'State Lookup'!$A:$B,2,FALSE),\"\")","v":""}]
[null,"",{"$f":"IFERROR(VLOOKUP(INDIRECT($A$5&ROW($A482)),'State Lookup'!$A:$B,2,FALSE),\"\")","v":""}]
[null,"",{"$f":"IFERROR(VLOOKUP(INDIRECT($A$5&ROW($A483)),'State Lookup'!$A:$B,2,FALSE),\"\")","v":""}]
[null,"",{"$f":"IFERROR(VLOOKUP(INDIRECT($A$5&ROW($A484)),'State Lookup'!$A:$B,2,FALSE),\"\")","v":""}]
[null,"",{"$f":"IFERROR(VLOOKUP(INDIRECT($A$5&ROW($A485)),'State Lookup'!$A:$B,2,FALSE),\"\")","v":""}]
[null,"",{"$f":"IFERROR(VLOOKUP(INDIRECT($A$5&ROW($A486)),'State Lookup'!$A:$B,2,FALSE),\"\")","v":""}]
[null,"",{"$f":"IFERROR(VLOOKUP(INDIRECT($A$5&ROW($A487)),'State Lookup'!$A:$B,2,FALSE),\"\")","v":""}]
[null,"",{"$f":"IFERROR(VLOOKUP(INDIRECT($A$5&ROW($A488)),'State Lookup'!$A:$B,2,FALSE),\"\")","v":""}]
[null,"",{"$f":"IFERROR(VLOOKUP(INDIRECT($A$5&ROW($A489)),'State Lookup'!$A:$B,2,FALSE),\"\")","v":""}]
[null,"",{"$f":"IFERROR(VLOOKUP(INDIRECT($A$5&ROW($A490)),'State Lookup'!$A:$B,2,FALSE),\"\")","v":""}]
[null,"",{"$f":"IFERROR(VLOOKUP(INDIRECT($A$5&ROW($A491)),'State Lookup'!$A:$B,2,FALSE),\"\")","v":""}]
[null,"",{"$f":"IFERROR(VLOOKUP(INDIRECT($A$5&ROW($A492)),'State Lookup'!$A:$B,2,FALSE),\"\")","v":""}]
[null,"",{"$f":"IFERROR(VLOOKUP(INDIRECT($A$5&ROW($A493)),'State Lookup'!$A:$B,2,FALSE),\"\")","v":""}]
[null,"",{"$f":"IFERROR(VLOOKUP(INDIRECT($A$5&ROW($A494)),'State Lookup'!$A:$B,2,FALSE),\"\")","v":""}]
[null,"",{"$f":"IFERROR(VLOOKUP(INDIRECT($A$5&ROW($A495)),'State Lookup'!$A:$B,2,FALSE),\"\")","v":""}]
[null,"",{"$f":"IFERROR(VLOOKUP(INDIRECT($A$5&ROW($A496)),'State Lookup'!$A:$B,2,FALSE),\"\")","v":""}]
[null,"",{"$f":"IFERROR(VLOOKUP(INDIRECT($A$5&ROW($A497)),'State Lookup'!$A:$B,2,FALSE),\"\")","v":""}]
[null,"",{"$f":"IFERROR(VLOOKUP(INDIRECT($A$5&ROW($A498)),'State Lookup'!$A:$B,2,FALSE),\"\")","v":""}]
[null,"",{"$f":"IFERROR(VLOOKUP(INDIRECT($A$5&ROW($A499)),'State Lookup'!$A:$B,2,FALSE),\"\")","v":""}]
[null,"",{"$f":"IFERROR(VLOOKUP(INDIRECT($A$5&ROW($A500)),'State Lookup'!$A:$B,2,FALSE),\"\")","v":""}]
[null,"",{"$f":"IFERROR(VLOOKUP(INDIRECT($A$5&ROW($A501)),'State Lookup'!$A:$B,2,FALSE),\"\")","v":""}]
[null,"",{"$f":"IFERROR(VLOOKUP(INDIRECT($A$5&ROW($A502)),'State Lookup'!$A:$B,2,FALSE),\"\")","v":""}]
[null,"",{"$f":"IFERROR(VLOOKUP(INDIRECT($A$5&ROW($A503)),'State Lookup'!$A:$B,2,FALSE),\"\")","v":""}]
[null,"",{"$f":"IFERROR(VLOOKUP(INDIRECT($A$5&ROW($A504)),'State Lookup'!$A:$B,2,FALSE),\"\")","v":""}]
[null,"",{"$f":"IFERROR(VLOOKUP(INDIRECT($A$5&ROW($A505)),'State Lookup'!$A:$B,2,FALSE),\"\")","v":""}]
[null,"",{"$f":"IFERROR(VLOOKUP(INDIRECT($A$5&ROW($A506)),'State Lookup'!$A:$B,2,FALSE),\"\")","v":""}]
[null,"",{"$f":"IFERROR(VLOOKUP(INDIRECT($A$5&ROW($A507)),'State Lookup'!$A:$B,2,FALSE),\"\")","v":""}]
[null,"",{"$f":"IFERROR(VLOOKUP(INDIRECT($A$5&ROW($A508)),'State Lookup'!$A:$B,2,FALSE),\"\")","v":""}]
[null,"",{"$f":"IFERROR(VLOOKUP(INDIRECT($A$5&ROW($A509)),'State Lookup'!$A:$B,2,FALSE),\"\")","v":""}]
[null,"",{"$f":"IFERROR(VLOOKUP(INDIRECT($A$5&ROW($A510)),'State Lookup'!$A:$B,2,FALSE),\"\")","v":""}]
[null,"",{"$f":"IFERROR(VLOOKUP(INDIRECT($A$5&ROW($A511)),'State Lookup'!$A:$B,2,FALSE),\"\")","v":""}]
[null,"",{"$f":"IFERROR(VLOOKUP(INDIRECT($A$5&ROW($A512)),'State Lookup'!$A:$B,2,FALSE),\"\")","v":""}]
[null,"",{"$f":"IFERROR(VLOOKUP(INDIRECT($A$5&ROW($A513)),'State Lookup'!$A:$B,2,FALSE),\"\")","v":""}]
[null,"",{"$f":"IFERROR(VLOOKUP(INDIRECT($A$5&ROW($A514)),'State Lookup'!$A:$B,2,FALSE),\"\")","v":""}]
[null,{"$f":"IFERROR((INDIRECT($A$3&ROW($A515))/INDIRECT($A$1&ROW($A515)))*100,\"\")","v":""},{"$f":"IFERROR(VLOOKUP(INDIRECT($A$5&ROW($A515)),'State Lookup'!$A:$B,2,FALSE),\"\")","v":""}]
[null,"",{"$f":"IFERROR(VLOOKUP(INDIRECT($A$5&ROW($A516)),'State Lookup'!$A:$B,2,FALSE),\"\")","v":""}]
[null,"",{"$f":"IFERROR(VLOOKUP(INDIRECT($A$5&ROW($A517)),'State Lookup'!$A:$B,2,FALSE),\"\")","v":""}]
[null,"",{"$f":"IFERROR(VLOOKUP(INDIRECT($A$5&ROW($A518)),'State Lookup'!$A:$B,2,FALSE),\"\")","v":""}]
[null,"",{"$f":"IFERROR(VLOOKUP(INDIRECT($A$5&ROW($A519)),'State Lookup'!$A:$B,2,FALSE),\"\")","v":""}]
[null,"",{"$f":"IFERROR(VLOOKUP(INDIRECT($A$5&ROW($A520)),'State Lookup'!$A:$B,2,FALSE),\"\")","v":""}]
[null,"",{"$f":"IFERROR(VLOOKUP(INDIRECT($A$5&ROW($A521)),'State Lookup'!$A:$B,2,FALSE),\"\")","v":""}]
[null,"",{"$f":"IFERROR(VLOOKUP(INDIRECT($A$5&ROW($A522)),'State Lookup'!$A:$B,2,FALSE),\"\")","v":""}]
[null,"",{"$f":"IFERROR(VLOOKUP(INDIRECT($A$5&ROW($A523)),'State Lookup'!$A:$B,2,FALSE),\"\")","v":""}]
[null,"",{"$f":"IFERROR(VLOOKUP(INDIRECT($A$5&ROW($A524)),'State Lookup'!$A:$B,2,FALSE),\"\")","v":""}]
[null,"",{"$f":"IFERROR(VLOOKUP(INDIRECT($A$5&ROW($A525)),'State Lookup'!$A:$B,2,FALSE),\"\")","v":""}]
[null,"",{"$f":"IFERROR(VLOOKUP(INDIRECT($A$5&ROW($A526)),'State Lookup'!$A:$B,2,FALSE),\"\")","v":""}]
[null,"",{"$f":"IFERROR(VLOOKUP(INDIRECT($A$5&ROW($A527)),'State Lookup'!$A:$B,2,FALSE),\"\")","v":""}]
[null,"",{"$f":"IFERROR(VLOOKUP(INDIRECT($A$5&ROW($A528)),'State Lookup'!$A:$B,2,FALSE),\"\")","v":""}]
[null,"",{"$f":"IFERROR(VLOOKUP(INDIRECT($A$5&ROW($A529)),'State Lookup'!$A:$B,2,FALSE),\"\")","v":""}]
[null,"",{"$f":"IFERROR(VLOOKUP(INDIRECT($A$5&ROW($A530)),'State Lookup'!$A:$B,2,FALSE),\"\")","v":""}]
[null,"",{"$f":"IFERROR(VLOOKUP(INDIRECT($A$5&ROW($A531)),'State Lookup'!$A:$B,2,FALSE),\"\")","v":""}]
[null,"",{"$f":"IFERROR(VLOOKUP(INDIRECT($A$5&ROW($A532)),'State Lookup'!$A:$B,2,FALSE),\"\")","v":""}]
[null,"",{"$f":"IFERROR(VLOOKUP(INDIRECT($A$5&ROW($A533)),'State Lookup'!$A:$B,2,FALSE),\"\")","v":""}]
[null,"",{"$f":"IFERROR(VLOOKUP(INDIRECT($A$5&ROW($A534)),'State Lookup'!$A:$B,2,FALSE),\"\")","v":""}]
[null,"",{"$f":"IFERROR(VLOOKUP(INDIRECT($A$5&ROW($A535)),'State Lookup'!$A:$B,2,FALSE),\"\")","v":""}]
[null,"",{"$f":"IFERROR(VLOOKUP(INDIRECT($A$5&ROW($A536)),'State Lookup'!$A:$B,2,FALSE),\"\")","v":""}]
[null,"",{"$f":"IFERROR(VLOOKUP(INDIRECT($A$5&ROW($A537)),'State Lookup'!$A:$B,2,FALSE),\"\")","v":""}]
[null,"",{"$f":"IFERROR(VLOOKUP(INDIRECT($A$5&ROW($A538)),'State Lookup'!$A:$B,2,FALSE),\"\")","v":""}]
[null,"",{"$f":"IFERROR(VLOOKUP(INDIRECT($A$5&ROW($A539)),'State Lookup'!$A:$B,2,FALSE),\"\")","v":""}]
[null,"",{"$f":"IFERROR(VLOOKUP(INDIRECT($A$5&ROW($A540)),'State Lookup'!$A:$B,2,FALSE),\"\")","v":""}]
[null,"",{"$f":"IFERROR(VLOOKUP(INDIRECT($A$5&ROW($A541)),'State Lookup'!$A:$B,2,FALSE),\"\")","v":""}]
[null,"",{"$f":"IFERROR(VLOOKUP(INDIRECT($A$5&ROW($A542)),'State Lookup'!$A:$B,2,FALSE),\"\")","v":""}]
[null,"",{"$f":"IFERROR(VLOOKUP(INDIRECT($A$5&ROW($A543)),'State Lookup'!$A:$B,2,FALSE),\"\")","v":""}]
[null,"",{"$f":"IFERROR(VLOOKUP(INDIRECT($A$5&ROW($A544)),'State Lookup'!$A:$B,2,FALSE),\"\")","v":""}]
[null,"",{"$f":"IFERROR(VLOOKUP(INDIRECT($A$5&ROW($A545)),'State Lookup'!$A:$B,2,FALSE),\"\")","v":""}]
[null,"",{"$f":"IFERROR(VLOOKUP(INDIRECT($A$5&ROW($A546)),'State Lookup'!$A:$B,2,FALSE),\"\")","v":""}]
[null,"",{"$f":"IFERROR(VLOOKUP(INDIRECT($A$5&ROW($A547)),'State Lookup'!$A:$B,2,FALSE),\"\")","v":""}]
[null,"",{"$f":"IFERROR(VLOOKUP(INDIRECT($A$5&ROW($A548)),'State Lookup'!$A:$B,2,FALSE),\"\")","v":""}]
[null,"",{"$f":"IFERROR(VLOOKUP(INDIRECT($A$5&ROW($A549)),'State Lookup'!$A:$B,2,FALSE),\"\")","v":""}]
[null,"",{"$f":"IFERROR(VLOOKUP(INDIRECT($A$5&ROW($A550)),'State Lookup'!$A:$B,2,FALSE),\"\")","v":""}]
[null,"",{"$f":"IFERROR(VLOOKUP(INDIRECT($A$5&ROW($A551)),'State Lookup'!$A:$B,2,FALSE),\"\")","v":""}]
[null,"",{"$f":"IFERROR(VLOOKUP(INDIRECT($A$5&ROW($A552)),'State Lookup'!$A:$B,2,FALSE),\"\")","v":""}]
[null,"",{"$f":"IFERROR(VLOOKUP(INDIRECT($A$5&ROW($A553)),'State Lookup'!$A:$B,2,FALSE),\"\")","v":""}]
[null,"",{"$f":"IFERROR(VLOOKUP(INDIRECT($A$5&ROW($A554)),'State Lookup'!$A:$B,2,FALSE),\"\")","v":""}]
[null,"",{"$f":"IFERROR(VLOOKUP(INDIRECT($A$5&ROW($A555)),'State Lookup'!$A:$B,2,FALSE),\"\")","v":""}]
[null,"",{"$f":"IFERROR(VLOOKUP(INDIRECT($A$5&ROW($A556)),'State Lookup'!$A:$B,2,FALSE),\"\")","v":""}]
[null,"",{"$f":"IFERROR(VLOOKUP(INDIRECT($A$5&ROW($A557)),'State Lookup'!$A:$B,2,FALSE),\"\")","v":""}]
[null,"",{"$f":"IFERROR(VLOOKUP(INDIRECT($A$5&ROW($A558)),'State Lookup'!$A:$B,2,FALSE),\"\")","v":""}]
[null,"",{"$f":"IFERROR(VLOOKUP(INDIRECT($A$5&ROW($A559)),'State Lookup'!$A:$B,2,FALSE),\"\")","v":""}]
[null,"",{"$f":"IFERROR(VLOOKUP(INDIRECT($A$5&ROW($A560)),'State Lookup'!$A:$B,2,FALSE),\"\")","v":""}]
[null,"",{"$f":"IFERROR(VLOOKUP(INDIRECT($A$5&ROW($A561)),'State Lookup'!$A:$B,2,FALSE),\"\")","v":""}]
[null,"",{"$f":"IFERROR(VLOOKUP(INDIRECT($A$5&ROW($A562)),'State Lookup'!$A:$B,2,FALSE),\"\")","v":""}]
[null,"",{"$f":"IFERROR(VLOOKUP(INDIRECT($A$5&ROW($A563)),'State Lookup'!$A:$B,2,FALSE),\"\")","v":""}]
[null,"",{"$f":"IFERROR(VLOOKUP(INDIRECT($A$5&ROW($A564)),'State Lookup'!$A:$B,2,FALSE),\"\")","v":""}]
[null,"",{"$f":"IFERROR(VLOOKUP(INDIRECT($A$5&ROW($A565)),'State Lookup'!$A:$B,2,FALSE),\"\")","v":""}]
[null,"",{"$f":"IFERROR(VLOOKUP(INDIRECT($A$5&ROW($A566)),'State Lookup'!$A:$B,2,FALSE),\"\")","v":""}]
[null,"",{"$f":"IFERROR(VLOOKUP(INDIRECT($A$5&ROW($A567)),'State Lookup'!$A:$B,2,FALSE),\"\")","v":""}]
[null,"",{"$f":"IFERROR(VLOOKUP(INDIRECT($A$5&ROW($A568)),'State Lookup'!$A:$B,2,FALSE),\"\")","v":""}]
[null,"",{"$f":"IFERROR(VLOOKUP(INDIRECT($A$5&ROW($A569)),'State Lookup'!$A:$B,2,FALSE),\"\")","v":""}]
[null,"",{"$f":"IFERROR(VLOOKUP(INDIRECT($A$5&ROW($A570)),'State Lookup'!$A:$B,2,FALSE),\"\")","v":""}]
[null,"",{"$f":"IFERROR(VLOOKUP(INDIRECT($A$5&ROW($A571)),'State Lookup'!$A:$B,2,FALSE),\"\")","v":""}]
[null,"",{"$f":"IFERROR(VLOOKUP(INDIRECT($A$5&ROW($A572)),'State Lookup'!$A:$B,2,FALSE),\"\")","v":""}]
[null,"",{"$f":"IFERROR(VLOOKUP(INDIRECT($A$5&ROW($A573)),'State Lookup'!$A:$B,2,FALSE),\"\")","v":""}]
[null,"",{"$f":"IFERROR(VLOOKUP(INDIRECT($A$5&ROW($A574)),'State Lookup'!$A:$B,2,FALSE),\"\")","v":""}]
[null,"",{"$f":"IFERROR(VLOOKUP(INDIRECT($A$5&ROW($A575)),'State Lookup'!$A:$B,2,FALSE),\"\")","v":""}]
[null,"",{"$f":"IFERROR(VLOOKUP(INDIRECT($A$5&ROW($A576)),'State Lookup'!$A:$B,2,FALSE),\"\")","v":""}]
[null,"",{"$f":"IFERROR(VLOOKUP(INDIRECT($A$5&ROW($A577)),'State Lookup'!$A:$B,2,FALSE),\"\")","v":""}]
[null,"",{"$f":"IFERROR(VLOOKUP(INDIRECT($A$5&ROW($A578)),'State Lookup'!$A:$B,2,FALSE),\"\")","v":""}]
[null,{"$f":"IFERROR((INDIRECT($A$3&ROW($A579))/INDIRECT($A$1&ROW($A579)))*100,\"\")","v":""},{"$f":"IFERROR(VLOOKUP(INDIRECT($A$5&ROW($A579)),'State Lookup'!$A:$B,2,FALSE),\"\")","v":""}]
[null,"",{"$f":"IFERROR(VLOOKUP(INDIRECT($A$5&ROW($A580)),'State Lookup'!$A:$B,2,FALSE),\"\")","v":""}]
[null,"",{"$f":"IFERROR(VLOOKUP(INDIRECT($A$5&ROW($A581)),'State Lookup'!$A:$B,2,FALSE),\"\")","v":""}]
[null,"",{"$f":"IFERROR(VLOOKUP(INDIRECT($A$5&ROW($A582)),'State Lookup'!$A:$B,2,FALSE),\"\")","v":""}]
[null,"",{"$f":"IFERROR(VLOOKUP(INDIRECT($A$5&ROW($A583)),'State Lookup'!$A:$B,2,FALSE),\"\")","v":""}]
[null,"",{"$f":"IFERROR(VLOOKUP(INDIRECT($A$5&ROW($A584)),'State Lookup'!$A:$B,2,FALSE),\"\")","v":""}]
[null,"",{"$f":"IFERROR(VLOOKUP(INDIRECT($A$5&ROW($A585)),'State Lookup'!$A:$B,2,FALSE),\"\")","v":""}]
[null,"",{"$f":"IFERROR(VLOOKUP(INDIRECT($A$5&ROW($A586)),'State Lookup'!$A:$B,2,FALSE),\"\")","v":""}]
[null,"",{"$f":"IFERROR(VLOOKUP(INDIRECT($A$5&ROW($A587)),'State Lookup'!$A:$B,2,FALSE),\"\")","v":""}]
[null,"",{"$f":"IFERROR(VLOOKUP(INDIRECT($A$5&ROW($A588)),'State Lookup'!$A:$B,2,FALSE),\"\")","v":""}]
[null,"",{"$f":"IFERROR(VLOOKUP(INDIRECT($A$5&ROW($A589)),'State Lookup'!$A:$B,2,FALSE),\"\")","v":""}]
[null,"",{"$f":"IFERROR(VLOOKUP(INDIRECT($A$5&ROW($A590)),'State Lookup'!$A:$B,2,FALSE),\"\")","v":""}]
[null,"",{"$f":"IFERROR(VLOOKUP(INDIRECT($A$5&ROW($A591)),'State Lookup'!$A:$B,2,FALSE),\"\")","v":""}]
[null,"",{"$f":"IFERROR(VLOOKUP(INDIRECT($A$5&ROW($A592)),'State Lookup'!$A:$B,2,FALSE),\"\")","v":""}]
[null,"",{"$f":"IFERROR(VLOOKUP(INDIRECT($A$5&ROW($A593)),'State Lookup'!$A:$B,2,FALSE),\"\")","v":""}]
[null,"",{"$f":"IFERROR(VLOOKUP(INDIRECT($A$5&ROW($A594)),'State Lookup'!$A:$B,2,FALSE),\"\")","v":""}]
[null,"",{"$f":"IFERROR(VLOOKUP(INDIRECT($A$5&ROW($A595)),'State Lookup'!$A:$B,2,FALSE),\"\")","v":""}]
[null,"",{"$f":"IFERROR(VLOOKUP(INDIRECT($A$5&ROW($A596)),'State Lookup'!$A:$B,2,FALSE),\"\")","v":""}]
[null,"",{"$f":"IFERROR(VLOOKUP(INDIRECT($A$5&ROW($A597)),'State Lookup'!$A:$B,2,FALSE),\"\")","v":""}]
[null,"",{"$f":"IFERROR(VLOOKUP(INDIRECT($A$5&ROW($A598)),'State Lookup'!$A:$B,2,FALSE),\"\")","v":""}]
[null,"",{"$f":"IFERROR(VLOOKUP(INDIRECT($A$5&ROW($A599)),'State Lookup'!$A:$B,2,FALSE),\"\")","v":""}]
[null,"",{"$f":"IFERROR(VLOOKUP(INDIRECT($A$5&ROW($A600)),'State Lookup'!$A:$B,2,FALSE),\"\")","v":""}]
[null,"",{"$f":"IFERROR(VLOOKUP(INDIRECT($A$5&ROW($A601)),'State Lookup'!$A:$B,2,FALSE),\"\")","v":""}]
[null,"",{"$f":"IFERROR(VLOOKUP(INDIRECT($A$5&ROW($A602)),'State Lookup'!$A:$B,2,FALSE),\"\")","v":""}]
[null,"",{"$f":"IFERROR(VLOOKUP(INDIRECT($A$5&ROW($A603)),'State Lookup'!$A:$B,2,FALSE),\"\")","v":""}]
[null,"",{"$f":"IFERROR(VLOOKUP(INDIRECT($A$5&ROW($A604)),'State Lookup'!$A:$B,2,FALSE),\"\")","v":""}]
[null,"",{"$f":"IFERROR(VLOOKUP(INDIRECT($A$5&ROW($A605)),'State Lookup'!$A:$B,2,FALSE),\"\")","v":""}]
[null,"",{"$f":"IFERROR(VLOOKUP(INDIRECT($A$5&ROW($A606)),'State Lookup'!$A:$B,2,FALSE),\"\")","v":""}]
[null,"",{"$f":"IFERROR(VLOOKUP(INDIRECT($A$5&ROW($A607)),'State Lookup'!$A:$B,2,FALSE),\"\")","v":""}]
[null,"",{"$f":"IFERROR(VLOOKUP(INDIRECT($A$5&ROW($A608)),'State Lookup'!$A:$B,2,FALSE),\"\")","v":""}]
[null,"",{"$f":"IFERROR(VLOOKUP(INDIRECT($A$5&ROW($A609)),'State Lookup'!$A:$B,2,FALSE),\"\")","v":""}]
[null,"",{"$f":"IFERROR(VLOOKUP(INDIRECT($A$5&ROW($A610)),'State Lookup'!$A:$B,2,FALSE),\"\")","v":""}]
[null,"",{"$f":"IFERROR(VLOOKUP(INDIRECT($A$5&ROW($A611)),'State Lookup'!$A:$B,2,FALSE),\"\")","v":""}]
[null,"",{"$f":"IFERROR(VLOOKUP(INDIRECT($A$5&ROW($A612)),'State Lookup'!$A:$B,2,FALSE),\"\")","v":""}]
[null,"",{"$f":"IFERROR(VLOOKUP(INDIRECT($A$5&ROW($A613)),'State Lookup'!$A:$B,2,FALSE),\"\")","v":""}]
[null,"",{"$f":"IFERROR(VLOOKUP(INDIRECT($A$5&ROW($A614)),'State Lookup'!$A:$B,2,FALSE),\"\")","v":""}]
[null,"",{"$f":"IFERROR(VLOOKUP(INDIRECT($A$5&ROW($A615)),'State Lookup'!$A:$B,2,FALSE),\"\")","v":""}]
[null,"",{"$f":"IFERROR(VLOOKUP(INDIRECT($A$5&ROW($A616)),'State Lookup'!$A:$B,2,FALSE),\"\")","v":""}]
[null,"",{"$f":"IFERROR(VLOOKUP(INDIRECT($A$5&ROW($A617)),'State Lookup'!$A:$B,2,FALSE),\"\")","v":""}]
[null,"",{"$f":"IFERROR(VLOOKUP(INDIRECT($A$5&ROW($A618)),'State Lookup'!$A:$B,2,FALSE),\"\")","v":""}]
[null,"",{"$f":"IFERROR(VLOOKUP(INDIRECT($A$5&ROW($A619)),'State Lookup'!$A:$B,2,FALSE),\"\")","v":""}]
[null,"",{"$f":"IFERROR(VLOOKUP(INDIRECT($A$5&ROW($A620)),'State Lookup'!$A:$B,2,FALSE),\"\")","v":""}]
[null,"",{"$f":"IFERROR(VLOOKUP(INDIRECT($A$5&ROW($A621)),'State Lookup'!$A:$B,2,FALSE),\"\")","v":""}]
[null,"",{"$f":"IFERROR(VLOOKUP(INDIRECT($A$5&ROW($A622)),'State Lookup'!$A:$B,2,FALSE),\"\")","v":""}]
[null,"",{"$f":"IFERROR(VLOOKUP(INDIRECT($A$5&ROW($A623)),'State Lookup'!$A:$B,2,FALSE),\"\")","v":""}]
[null,"",{"$f":"IFERROR(VLOOKUP(INDIRECT($A$5&ROW($A624)),'State Lookup'!$A:$B,2,FALSE),\"\")","v":""}]
[null,"",{"$f":"IFERROR(VLOOKUP(INDIRECT($A$5&ROW($A625)),'State Lookup'!$A:$B,2,FALSE),\"\")","v":""}]
[null,"",{"$f":"IFERROR(VLOOKUP(INDIRECT($A$5&ROW($A626)),'State Lookup'!$A:$B,2,FALSE),\"\")","v":""}]
[null,"",{"$f":"IFERROR(VLOOKUP(INDIRECT($A$5&ROW($A627)),'State Lookup'!$A:$B,2,FALSE),\"\")","v":""}]
[null,"",{"$f":"IFERROR(VLOOKUP(INDIRECT($A$5&ROW($A628)),'State Lookup'!$A:$B,2,FALSE),\"\")","v":""}]
[null,"",{"$f":"IFERROR(VLOOKUP(INDIRECT($A$5&ROW($A629)),'State Lookup'!$A:$B,2,FALSE),\"\")","v":""}]
[null,"",{"$f":"IFERROR(VLOOKUP(INDIRECT($A$5&ROW($A630)),'State Lookup'!$A:$B,2,FALSE),\"\")","v":""}]
[null,"",{"$f":"IFERROR(VLOOKUP(INDIRECT($A$5&ROW($A631)),'State Lookup'!$A:$B,2,FALSE),\"\")","v":""}]
[null,"",{"$f":"IFERROR(VLOOKUP(INDIRECT($A$5&ROW($A632)),'State Lookup'!$A:$B,2,FALSE),\"\")","v":""}]
[null,"",{"$f":"IFERROR(VLOOKUP(INDIRECT($A$5&ROW($A633)),'State Lookup'!$A:$B,2,FALSE),\"\")","v":""}]
[null,"",{"$f":"IFERROR(VLOOKUP(INDIRECT($A$5&ROW($A634)),'State Lookup'!$A:$B,2,FALSE),\"\")","v":""}]
[null,"",{"$f":"IFERROR(VLOOKUP(INDIRECT($A$5&ROW($A635)),'State Lookup'!$A:$B,2,FALSE),\"\")","v":""}]
[null,"",{"$f":"IFERROR(VLOOKUP(INDIRECT($A$5&ROW($A636)),'State Lookup'!$A:$B,2,FALSE),\"\")","v":""}]
[null,"",{"$f":"IFERROR(VLOOKUP(INDIRECT($A$5&ROW($A637)),'State Lookup'!$A:$B,2,FALSE),\"\")","v":""}]
[null,"",{"$f":"IFERROR(VLOOKUP(INDIRECT($A$5&ROW($A638)),'State Lookup'!$A:$B,2,FALSE),\"\")","v":""}]
[null,"",{"$f":"IFERROR(VLOOKUP(INDIRECT($A$5&ROW($A639)),'State Lookup'!$A:$B,2,FALSE),\"\")","v":""}]
[null,"",{"$f":"IFERROR(VLOOKUP(INDIRECT($A$5&ROW($A640)),'State Lookup'!$A:$B,2,FALSE),\"\")","v":""}]
[null,"",{"$f":"IFERROR(VLOOKUP(INDIRECT($A$5&ROW($A641)),'State Lookup'!$A:$B,2,FALSE),\"\")","v":""}]
[null,"",{"$f":"IFERROR(VLOOKUP(INDIRECT($A$5&ROW($A642)),'State Lookup'!$A:$B,2,FALSE),\"\")","v":""}]
[null,{"$f":"IFERROR((INDIRECT($A$3&ROW($A643))/INDIRECT($A$1&ROW($A643)))*100,\"\")","v":""},{"$f":"IFERROR(VLOOKUP(INDIRECT($A$5&ROW($A643)),'State Lookup'!$A:$B,2,FALSE),\"\")","v":""}]
[null,"",{"$f":"IFERROR(VLOOKUP(INDIRECT($A$5&ROW($A644)),'State Lookup'!$A:$B,2,FALSE),\"\")","v":""}]
[null,"",{"$f":"IFERROR(VLOOKUP(INDIRECT($A$5&ROW($A645)),'State Lookup'!$A:$B,2,FALSE),\"\")","v":""}]
[null,"",{"$f":"IFERROR(VLOOKUP(INDIRECT($A$5&ROW($A646)),'State Lookup'!$A:$B,2,FALSE),\"\")","v":""}]
[null,"",{"$f":"IFERROR(VLOOKUP(INDIRECT($A$5&ROW($A647)),'State Lookup'!$A:$B,2,FALSE),\"\")","v":""}]
[null,"",{"$f":"IFERROR(VLOOKUP(INDIRECT($A$5&ROW($A648)),'State Lookup'!$A:$B,2,FALSE),\"\")","v":""}]
[null,"",{"$f":"IFERROR(VLOOKUP(INDIRECT($A$5&ROW($A649)),'State Lookup'!$A:$B,2,FALSE),\"\")","v":""}]
[null,"",{"$f":"IFERROR(VLOOKUP(INDIRECT($A$5&ROW($A650)),'State Lookup'!$A:$B,2,FALSE),\"\")","v":""}]
[null,"",{"$f":"IFERROR(VLOOKUP(INDIRECT($A$5&ROW($A651)),'State Lookup'!$A:$B,2,FALSE),\"\")","v":""}]
[null,"",{"$f":"IFERROR(VLOOKUP(INDIRECT($A$5&ROW($A652)),'State Lookup'!$A:$B,2,FALSE),\"\")","v":""}]
[null,"",{"$f":"IFERROR(VLOOKUP(INDIRECT($A$5&ROW($A653)),'State Lookup'!$A:$B,2,FALSE),\"\")","v":""}]
[null,"",{"$f":"IFERROR(VLOOKUP(INDIRECT($A$5&ROW($A654)),'State Lookup'!$A:$B,2,FALSE),\"\")","v":""}]
[null,"",{"$f":"IFERROR(VLOOKUP(INDIRECT($A$5&ROW($A655)),'State Lookup'!$A:$B,2,FALSE),\"\")","v":""}]
[null,"",{"$f":"IFERROR(VLOOKUP(INDIRECT($A$5&ROW($A656)),'State Lookup'!$A:$B,2,FALSE),\"\")","v":""}]
[null,"",{"$f":"IFERROR(VLOOKUP(INDIRECT($A$5&ROW($A657)),'State Lookup'!$A:$B,2,FALSE),\"\")","v":""}]
[null,"",{"$f":"IFERROR(VLOOKUP(INDIRECT($A$5&ROW($A658)),'State Lookup'!$A:$B,2,FALSE),\"\")","v":""}]
[null,"",{"$f":"IFERROR(VLOOKUP(INDIRECT($A$5&ROW($A659)),'State Lookup'!$A:$B,2,FALSE),\"\")","v":""}]
[null,"",{"$f":"IFERROR(VLOOKUP(INDIRECT($A$5&ROW($A660)),'State Lookup'!$A:$B,2,FALSE),\"\")","v":""}]
[null,"",{"$f":"IFERROR(VLOOKUP(INDIRECT($A$5&ROW($A661)),'State Lookup'!$A:$B,2,FALSE),\"\")","v":""}]
[null,"",{"$f":"IFERROR(VLOOKUP(INDIRECT($A$5&ROW($A662)),'State Lookup'!$A:$B,2,FALSE),\"\")","v":""}]
[null,"",{"$f":"IFERROR(VLOOKUP(INDIRECT($A$5&ROW($A663)),'State Lookup'!$A:$B,2,FALSE),\"\")","v":""}]
[null,"",{"$f":"IFERROR(VLOOKUP(INDIRECT($A$5&ROW($A664)),'State Lookup'!$A:$B,2,FALSE),\"\")","v":""}]
[null,"",{"$f":"IFERROR(VLOOKUP(INDIRECT($A$5&ROW($A665)),'State Lookup'!$A:$B,2,FALSE),\"\")","v":""}]
[null,"",{"$f":"IFERROR(VLOOKUP(INDIRECT($A$5&ROW($A666)),'State Lookup'!$A:$B,2,FALSE),\"\")","v":""}]
[null,"",{"$f":"IFERROR(VLOOKUP(INDIRECT($A$5&ROW($A667)),'State Lookup'!$A:$B,2,FALSE),\"\")","v":""}]
[null,"",{"$f":"IFERROR(VLOOKUP(INDIRECT($A$5&ROW($A668)),'State Lookup'!$A:$B,2,FALSE),\"\")","v":""}]
[null,"",{"$f":"IFERROR(VLOOKUP(INDIRECT($A$5&ROW($A669)),'State Lookup'!$A:$B,2,FALSE),\"\")","v":""}]
[null,"",{"$f":"IFERROR(VLOOKUP(INDIRECT($A$5&ROW($A670)),'State Lookup'!$A:$B,2,FALSE),\"\")","v":""}]
[null,"",{"$f":"IFERROR(VLOOKUP(INDIRECT($A$5&ROW($A671)),'State Lookup'!$A:$B,2,FALSE),\"\")","v":""}]
[null,"",{"$f":"IFERROR(VLOOKUP(INDIRECT($A$5&ROW($A672)),'State Lookup'!$A:$B,2,FALSE),\"\")","v":""}]
[null,"",{"$f":"IFERROR(VLOOKUP(INDIRECT($A$5&ROW($A673)),'State Lookup'!$A:$B,2,FALSE),\"\")","v":""}]
[null,"",{"$f":"IFERROR(VLOOKUP(INDIRECT($A$5&ROW($A674)),'State Lookup'!$A:$B,2,FALSE),\"\")","v":""}]
[null,"",{"$f":"IFERROR(VLOOKUP(INDIRECT($A$5&ROW($A675)),'State Lookup'!$A:$B,2,FALSE),\"\")","v":""}]
[null,"",{"$f":"IFERROR(VLOOKUP(INDIRECT($A$5&ROW($A676)),'State Lookup'!$A:$B,2,FALSE),\"\")","v":""}]
[null,"",{"$f":"IFERROR(VLOOKUP(INDIRECT($A$5&ROW($A677)),'State Lookup'!$A:$B,2,FALSE),\"\")","v":""}]
[null,"",{"$f":"IFERROR(VLOOKUP(INDIRECT($A$5&ROW($A678)),'State Lookup'!$A:$B,2,FALSE),\"\")","v":""}]
[null,"",{"$f":"IFERROR(VLOOKUP(INDIRECT($A$5&ROW($A679)),'State Lookup'!$A:$B,2,FALSE),\"\")","v":""}]
[null,"",{"$f":"IFERROR(VLOOKUP(INDIRECT($A$5&ROW($A680)),'State Lookup'!$A:$B,2,FALSE),\"\")","v":""}]
[null,"",{"$f":"IFERROR(VLOOKUP(INDIRECT($A$5&ROW($A681)),'State Lookup'!$A:$B,2,FALSE),\"\")","v":""}]
[null,"",{"$f":"IFERROR(VLOOKUP(INDIRECT($A$5&ROW($A682)),'State Lookup'!$A:$B,2,FALSE),\"\")","v":""}]
[null,"",{"$f":"IFERROR(VLOOKUP(INDIRECT($A$5&ROW($A683)),'State Lookup'!$A:$B,2,FALSE),\"\")","v":""}]
[null,"",{"$f":"IFERROR(VLOOKUP(INDIRECT($A$5&ROW($A684)),'State Lookup'!$A:$B,2,FALSE),\"\")","v":""}]
[null,"",{"$f":"IFERROR(VLOOKUP(INDIRECT($A$5&ROW($A685)),'State Lookup'!$A:$B,2,FALSE),\"\")","v":""}]
[null,"",{"$f":"IFERROR(VLOOKUP(INDIRECT($A$5&ROW($A686)),'State Lookup'!$A:$B,2,FALSE),\"\")","v":""}]
[null,"",{"$f":"IFERROR(VLOOKUP(INDIRECT($A$5&ROW($A687)),'State Lookup'!$A:$B,2,FALSE),\"\")","v":""}]
[null,"",{"$f":"IFERROR(VLOOKUP(INDIRECT($A$5&ROW($A688)),'State Lookup'!$A:$B,2,FALSE),\"\")","v":""}]
[null,"",{"$f":"IFERROR(VLOOKUP(INDIRECT($A$5&ROW($A689)),'State Lookup'!$A:$B,2,FALSE),\"\")","v":""}]
[null,"",{"$f":"IFERROR(VLOOKUP(INDIRECT($A$5&ROW($A690)),'State Lookup'!$A:$B,2,FALSE),\"\")","v":""}]
[null,"",{"$f":"IFERROR(VLOOKUP(INDIRECT($A$5&ROW($A691)),'State Lookup'!$A:$B,2,FALSE),\"\")","v":""}]
[null,"",{"$f":"IFERROR(VLOOKUP(INDIRECT($A$5&ROW($A692)),'State Lookup'!$A:$B,2,FALSE),\"\")","v":""}]
[null,"",{"$f":"IFERROR(VLOOKUP(INDIRECT($A$5&ROW($A693)),'State Lookup'!$A:$B,2,FALSE),\"\")","v":""}]
[null,"",{"$f":"IFERROR(VLOOKUP(INDIRECT($A$5&ROW($A694)),'State Lookup'!$A:$B,2,FALSE),\"\")","v":""}]
[null,"",{"$f":"IFERROR(VLOOKUP(INDIRECT($A$5&ROW($A695)),'State Lookup'!$A:$B,2,FALSE),\"\")","v":""}]
[null,"",{"$f":"IFERROR(VLOOKUP(INDIRECT($A$5&ROW($A696)),'State Lookup'!$A:$B,2,FALSE),\"\")","v":""}]
[null,"",{"$f":"IFERROR(VLOOKUP(INDIRECT($A$5&ROW($A697)),'State Lookup'!$A:$B,2,FALSE),\"\")","v":""}]
[null,"",{"$f":"IFERROR(VLOOKUP(INDIRECT($A$5&ROW($A698)),'State Lookup'!$A:$B,2,FALSE),\"\")","v":""}]
[null,"",{"$f":"IFERROR(VLOOKUP(INDIRECT($A$5&ROW($A699)),'State Lookup'!$A:$B,2,FALSE),\"\")","v":""}]
[null,"",{"$f":"IFERROR(VLOOKUP(INDIRECT($A$5&ROW($A700)),'State Lookup'!$A:$B,2,FALSE),\"\")","v":""}]
[null,"",{"$f":"IFERROR(VLOOKUP(INDIRECT($A$5&ROW($A701)),'State Lookup'!$A:$B,2,FALSE),\"\")","v":""}]
[null,"",{"$f":"IFERROR(VLOOKUP(INDIRECT($A$5&ROW($A702)),'State Lookup'!$A:$B,2,FALSE),\"\")","v":""}]
[null,"",{"$f":"IFERROR(VLOOKUP(INDIRECT($A$5&ROW($A703)),'State Lookup'!$A:$B,2,FALSE),\"\")","v":""}]
[null,"",{"$f":"IFERROR(VLOOKUP(INDIRECT($A$5&ROW($A704)),'State Lookup'!$A:$B,2,FALSE),\"\")","v":""}]
[null,"",{"$f":"IFERROR(VLOOKUP(INDIRECT($A$5&ROW($A705)),'State Lookup'!$A:$B,2,FALSE),\"\")","v":""}]
[null,"",{"$f":"IFERROR(VLOOKUP(INDIRECT($A$5&ROW($A706)),'State Lookup'!$A:$B,2,FALSE),\"\")","v":""}]
[null,{"$f":"IFERROR((INDIRECT($A$3&ROW($A707))/INDIRECT($A$1&ROW($A707)))*100,\"\")","v":""},{"$f":"IFERROR(VLOOKUP(INDIRECT($A$5&ROW($A707)),'State Lookup'!$A:$B,2,FALSE),\"\")","v":""}]
[null,"",{"$f":"IFERROR(VLOOKUP(INDIRECT($A$5&ROW($A708)),'State Lookup'!$A:$B,2,FALSE),\"\")","v":""}]
[null,"",{"$f":"IFERROR(VLOOKUP(INDIRECT($A$5&ROW($A709)),'State Lookup'!$A:$B,2,FALSE),\"\")","v":""}]
[null,"",{"$f":"IFERROR(VLOOKUP(INDIRECT($A$5&ROW($A710)),'State Lookup'!$A:$B,2,FALSE),\"\")","v":""}]
[null,"",{"$f":"IFERROR(VLOOKUP(INDIRECT($A$5&ROW($A711)),'State Lookup'!$A:$B,2,FALSE),\"\")","v":""}]
[null,"",{"$f":"IFERROR(VLOOKUP(INDIRECT($A$5&ROW($A712)),'State Lookup'!$A:$B,2,FALSE),\"\")","v":""}]
[null,"",{"$f":"IFERROR(VLOOKUP(INDIRECT($A$5&ROW($A713)),'State Lookup'!$A:$B,2,FALSE),\"\")","v":""}]
[null,"",{"$f":"IFERROR(VLOOKUP(INDIRECT($A$5&ROW($A714)),'State Lookup'!$A:$B,2,FALSE),\"\")","v":""}]
[null,"",{"$f":"IFERROR(VLOOKUP(INDIRECT($A$5&ROW($A715)),'State Lookup'!$A:$B,2,FALSE),\"\")","v":""}]
[null,"",{"$f":"IFERROR(VLOOKUP(INDIRECT($A$5&ROW($A716)),'State Lookup'!$A:$B,2,FALSE),\"\")","v":""}]
[null,"",{"$f":"IFERROR(VLOOKUP(INDIRECT($A$5&ROW($A717)),'State Lookup'!$A:$B,2,FALSE),\"\")","v":""}]
[null,"",{"$f":"IFERROR(VLOOKUP(INDIRECT($A$5&ROW($A718)),'State Lookup'!$A:$B,2,FALSE),\"\")","v":""}]
[null,"",{"$f":"IFERROR(VLOOKUP(INDIRECT($A$5&ROW($A719)),'State Lookup'!$A:$B,2,FALSE),\"\")","v":""}]
[null,"",{"$f":"IFERROR(VLOOKUP(INDIRECT($A$5&ROW($A720)),'State Lookup'!$A:$B,2,FALSE),\"\")","v":""}]
[null,"",{"$f":"IFERROR(VLOOKUP(INDIRECT($A$5&ROW($A721)),'State Lookup'!$A:$B,2,FALSE),\"\")","v":""}]
[null,"",{"$f":"IFERROR(VLOOKUP(INDIRECT($A$5&ROW($A722)),'State Lookup'!$A:$B,2,FALSE),\"\")","v":""}]
[null,"",{"$f":"IFERROR(VLOOKUP(INDIRECT($A$5&ROW($A723)),'State Lookup'!$A:$B,2,FALSE),\"\")","v":""}]
[null,"",{"$f":"IFERROR(VLOOKUP(INDIRECT($A$5&ROW($A724)),'State Lookup'!$A:$B,2,FALSE),\"\")","v":""}]
[null,"",{"$f":"IFERROR(VLOOKUP(INDIRECT($A$5&ROW($A725)),'State Lookup'!$A:$B,2,FALSE),\"\")","v":""}]
[null,"",{"$f":"IFERROR(VLOOKUP(INDIRECT($A$5&ROW($A726)),'State Lookup'!$A:$B,2,FALSE),\"\")","v":""}]
[null,"",{"$f":"IFERROR(VLOOKUP(INDIRECT($A$5&ROW($A727)),'State Lookup'!$A:$B,2,FALSE),\"\")","v":""}]
[null,"",{"$f":"IFERROR(VLOOKUP(INDIRECT($A$5&ROW($A728)),'State Lookup'!$A:$B,2,FALSE),\"\")","v":""}]
[null,"",{"$f":"IFERROR(VLOOKUP(INDIRECT($A$5&ROW($A729)),'State Lookup'!$A:$B,2,FALSE),\"\")","v":""}]
[null,"",{"$f":"IFERROR(VLOOKUP(INDIRECT($A$5&ROW($A730)),'State Lookup'!$A:$B,2,FALSE),\"\")","v":""}]
[null,"",{"$f":"IFERROR(VLOOKUP(INDIRECT($A$5&ROW($A731)),'State Lookup'!$A:$B,2,FALSE),\"\")","v":""}]
[null,"",{"$f":"IFERROR(VLOOKUP(INDIRECT($A$5&ROW($A732)),'State Lookup'!$A:$B,2,FALSE),\"\")","v":""}]
[null,"",{"$f":"IFERROR(VLOOKUP(INDIRECT($A$5&ROW($A733)),'State Lookup'!$A:$B,2,FALSE),\"\")","v":""}]
[null,"",{"$f":"IFERROR(VLOOKUP(INDIRECT($A$5&ROW($A734)),'State Lookup'!$A:$B,2,FALSE),\"\")","v":""}]
[null,"",{"$f":"IFERROR(VLOOKUP(INDIRECT($A$5&ROW($A735)),'State Lookup'!$A:$B,2,FALSE),\"\")","v":""}]
[null,"",{"$f":"IFERROR(VLOOKUP(INDIRECT($A$5&ROW($A736)),'State Lookup'!$A:$B,2,FALSE),\"\")","v":""}]
[null,"",{"$f":"IFERROR(VLOOKUP(INDIRECT($A$5&ROW($A737)),'State Lookup'!$A:$B,2,FALSE),\"\")","v":""}]
[null,"",{"$f":"IFERROR(VLOOKUP(INDIRECT($A$5&ROW($A738)),'State Lookup'!$A:$B,2,FALSE),\"\")","v":""}]
[null,"",{"$f":"IFERROR(VLOOKUP(INDIRECT($A$5&ROW($A739)),'State Lookup'!$A:$B,2,FALSE),\"\")","v":""}]
[null,"",{"$f":"IFERROR(VLOOKUP(INDIRECT($A$5&ROW($A740)),'State Lookup'!$A:$B,2,FALSE),\"\")","v":""}]
[null,"",{"$f":"IFERROR(VLOOKUP(INDIRECT($A$5&ROW($A741)),'State Lookup'!$A:$B,2,FALSE),\"\")","v":""}]
[null,"",{"$f":"IFERROR(VLOOKUP(INDIRECT($A$5&ROW($A742)),'State Lookup'!$A:$B,2,FALSE),\"\")","v":""}]
[null,"",{"$f":"IFERROR(VLOOKUP(INDIRECT($A$5&ROW($A743)),'State Lookup'!$A:$B,2,FALSE),\"\")","v":""}]
[null,"",{"$f":"IFERROR(VLOOKUP(INDIRECT($A$5&ROW($A744)),'State Lookup'!$A:$B,2,FALSE),\"\")","v":""}]
[null,"",{"$f":"IFERROR(VLOOKUP(INDIRECT($A$5&ROW($A745)),'State Lookup'!$A:$B,2,FALSE),\"\")","v":""}]
[null,"",{"$f":"IFERROR(VLOOKUP(INDIRECT($A$5&ROW($A746)),'State Lookup'!$A:$B,2,FALSE),\"\")","v":""}]
[null,"",{"$f":"IFERROR(VLOOKUP(INDIRECT($A$5&ROW($A747)),'State Lookup'!$A:$B,2,FALSE),\"\")","v":""}]
[null,"",{"$f":"IFERROR(VLOOKUP(INDIRECT($A$5&ROW($A748)),'State Lookup'!$A:$B,2,FALSE),\"\")","v":""}]
[null,"",{"$f":"IFERROR(VLOOKUP(INDIRECT($A$5&ROW($A749)),'State Lookup'!$A:$B,2,FALSE),\"\")","v":""}]
[null,"",{"$f":"IFERROR(VLOOKUP(INDIRECT($A$5&ROW($A750)),'State Lookup'!$A:$B,2,FALSE),\"\")","v":""}]
[null,"",{"$f":"IFERROR(VLOOKUP(INDIRECT($A$5&ROW($A751)),'State Lookup'!$A:$B,2,FALSE),\"\")","v":""}]
[null,"",{"$f":"IFERROR(VLOOKUP(INDIRECT($A$5&ROW($A752)),'State Lookup'!$A:$B,2,FALSE),\"\")","v":""}]
[null,"",{"$f":"IFERROR(VLOOKUP(INDIRECT($A$5&ROW($A753)),'State Lookup'!$A:$B,2,FALSE),\"\")","v":""}]
[null,"",{"$f":"IFERROR(VLOOKUP(INDIRECT($A$5&ROW($A754)),'State Lookup'!$A:$B,2,FALSE),\"\")","v":""}]
[null,"",{"$f":"IFERROR(VLOOKUP(INDIRECT($A$5&ROW($A755)),'State Lookup'!$A:$B,2,FALSE),\"\")","v":""}]
[null,"",{"$f":"IFERROR(VLOOKUP(INDIRECT($A$5&ROW($A756)),'State Lookup'!$A:$B,2,FALSE),\"\")","v":""}]
[null,"",{"$f":"IFERROR(VLOOKUP(INDIRECT($A$5&ROW($A757)),'State Lookup'!$A:$B,2,FALSE),\"\")","v":""}]
[null,"",{"$f":"IFERROR(VLOOKUP(INDIRECT($A$5&ROW($A758)),'State Lookup'!$A:$B,2,FALSE),\"\")","v":""}]
[null,"",{"$f":"IFERROR(VLOOKUP(INDIRECT($A$5&ROW($A759)),'State Lookup'!$A:$B,2,FALSE),\"\")","v":""}]
[null,"",{"$f":"IFERROR(VLOOKUP(INDIRECT($A$5&ROW($A760)),'State Lookup'!$A:$B,2,FALSE),\"\")","v":""}]
[null,"",{"$f":"IFERROR(VLOOKUP(INDIRECT($A$5&ROW($A761)),'State Lookup'!$A:$B,2,FALSE),\"\")","v":""}]
[null,"",{"$f":"IFERROR(VLOOKUP(INDIRECT($A$5&ROW($A762)),'State Lookup'!$A:$B,2,FALSE),\"\")","v":""}]
[null,"",{"$f":"IFERROR(VLOOKUP(INDIRECT($A$5&ROW($A763)),'State Lookup'!$A:$B,2,FALSE),\"\")","v":""}]
[null,"",{"$f":"IFERROR(VLOOKUP(INDIRECT($A$5&ROW($A764)),'State Lookup'!$A:$B,2,FALSE),\"\")","v":""}]
[null,"",{"$f":"IFERROR(VLOOKUP(INDIRECT($A$5&ROW($A765)),'State Lookup'!$A:$B,2,FALSE),\"\")","v":""}]
[null,"",{"$f":"IFERROR(VLOOKUP(INDIRECT($A$5&ROW($A766)),'State Lookup'!$A:$B,2,FALSE),\"\")","v":""}]
[null,"",{"$f":"IFERROR(VLOOKUP(INDIRECT($A$5&ROW($A767)),'State Lookup'!$A:$B,2,FALSE),\"\")","v":""}]
[null,"",{"$f":"IFERROR(VLOOKUP(INDIRECT($A$5&ROW($A768)),'State Lookup'!$A:$B,2,FALSE),\"\")","v":""}]
[null,"",{"$f":"IFERROR(VLOOKUP(INDIRECT($A$5&ROW($A769)),'State Lookup'!$A:$B,2,FALSE),\"\")","v":""}]
[null,"",{"$f":"IFERROR(VLOOKUP(INDIRECT($A$5&ROW($A770)),'State Lookup'!$A:$B,2,FALSE),\"\")","v":""}]
[null,{"$f":"IFERROR((INDIRECT($A$3&ROW($A771))/INDIRECT($A$1&ROW($A771)))*100,\"\")","v":""},{"$f":"IFERROR(VLOOKUP(INDIRECT($A$5&ROW($A771)),'State Lookup'!$A:$B,2,FALSE),\"\")","v":""}]
[null,"",{"$f":"IFERROR(VLOOKUP(INDIRECT($A$5&ROW($A772)),'State Lookup'!$A:$B,2,FALSE),\"\")","v":""}]
[null,"",{"$f":"IFERROR(VLOOKUP(INDIRECT($A$5&ROW($A773)),'State Lookup'!$A:$B,2,FALSE),\"\")","v":""}]
[null,"",{"$f":"IFERROR(VLOOKUP(INDIRECT($A$5&ROW($A774)),'State Lookup'!$A:$B,2,FALSE),\"\")","v":""}]
[null,"",{"$f":"IFERROR(VLOOKUP(INDIRECT($A$5&ROW($A775)),'State Lookup'!$A:$B,2,FALSE),\"\")","v":""}]
[null,"",{"$f":"IFERROR(VLOOKUP(INDIRECT($A$5&ROW($A776)),'State Lookup'!$A:$B,2,FALSE),\"\")","v":""}]
[null,"",{"$f":"IFERROR(VLOOKUP(INDIRECT($A$5&ROW($A777)),'State Lookup'!$A:$B,2,FALSE),\"\")","v":""}]
[null,"",{"$f":"IFERROR(VLOOKUP(INDIRECT($A$5&ROW($A778)),'State Lookup'!$A:$B,2,FALSE),\"\")","v":""}]
[null,"",{"$f":"IFERROR(VLOOKUP(INDIRECT($A$5&ROW($A779)),'State Lookup'!$A:$B,2,FALSE),\"\")","v":""}]
[null,"",{"$f":"IFERROR(VLOOKUP(INDIRECT($A$5&ROW($A780)),'State Lookup'!$A:$B,2,FALSE),\"\")","v":""}]
[null,"",{"$f":"IFERROR(VLOOKUP(INDIRECT($A$5&ROW($A781)),'State Lookup'!$A:$B,2,FALSE),\"\")","v":""}]
[null,"",{"$f":"IFERROR(VLOOKUP(INDIRECT($A$5&ROW($A782)),'State Lookup'!$A:$B,2,FALSE),\"\")","v":""}]
[null,"",{"$f":"IFERROR(VLOOKUP(INDIRECT($A$5&ROW($A783)),'State Lookup'!$A:$B,2,FALSE),\"\")","v":""}]
[null,"",{"$f":"IFERROR(VLOOKUP(INDIRECT($A$5&ROW($A784)),'State Lookup'!$A:$B,2,FALSE),\"\")","v":""}]
[null,"",{"$f":"IFERROR(VLOOKUP(INDIRECT($A$5&ROW($A785)),'State Lookup'!$A:$B,2,FALSE),\"\")","v":""}]
[null,"",{"$f":"IFERROR(VLOOKUP(INDIRECT($A$5&ROW($A786)),'State Lookup'!$A:$B,2,FALSE),\"\")","v":""}]
[null,"",{"$f":"IFERROR(VLOOKUP(INDIRECT($A$5&ROW($A787)),'State Lookup'!$A:$B,2,FALSE),\"\")","v":""}]
[null,"",{"$f":"IFERROR(VLOOKUP(INDIRECT($A$5&ROW($A788)),'State Lookup'!$A:$B,2,FALSE),\"\")","v":""}]
[null,"",{"$f":"IFERROR(VLOOKUP(INDIRECT($A$5&ROW($A789)),'State Lookup'!$A:$B,2,FALSE),\"\")","v":""}]
[null,"",{"$f":"IFERROR(VLOOKUP(INDIRECT($A$5&ROW($A790)),'State Lookup'!$A:$B,2,FALSE),\"\")","v":""}]
[null,"",{"$f":"IFERROR(VLOOKUP(INDIRECT($A$5&ROW($A791)),'State Lookup'!$A:$B,2,FALSE),\"\")","v":""}]
[null,"",{"$f":"IFERROR(VLOOKUP(INDIRECT($A$5&ROW($A792)),'State Lookup'!$A:$B,2,FALSE),\"\")","v":""}]
[null,"",{"$f":"IFERROR(VLOOKUP(INDIRECT($A$5&ROW($A793)),'State Lookup'!$A:$B,2,FALSE),\"\")","v":""}]
[null,"",{"$f":"IFERROR(VLOOKUP(INDIRECT($A$5&ROW($A794)),'State Lookup'!$A:$B,2,FALSE),\"\")","v":""}]
[null,"",{"$f":"IFERROR(VLOOKUP(INDIRECT($A$5&ROW($A795)),'State Lookup'!$A:$B,2,FALSE),\"\")","v":""}]
[null,"",{"$f":"IFERROR(VLOOKUP(INDIRECT($A$5&ROW($A796)),'State Lookup'!$A:$B,2,FALSE),\"\")","v":""}]
[null,"",{"$f":"IFERROR(VLOOKUP(INDIRECT($A$5&ROW($A797)),'State Lookup'!$A:$B,2,FALSE),\"\")","v":""}]
[null,"",{"$f":"IFERROR(VLOOKUP(INDIRECT($A$5&ROW($A798)),'State Lookup'!$A:$B,2,FALSE),\"\")","v":""}]
[null,"",{"$f":"IFERROR(VLOOKUP(INDIRECT($A$5&ROW($A799)),'State Lookup'!$A:$B,2,FALSE),\"\")","v":""}]
[null,"",{"$f":"IFERROR(VLOOKUP(INDIRECT($A$5&ROW($A800)),'State Lookup'!$A:$B,2,FALSE),\"\")","v":""}]
[null,"",{"$f":"IFERROR(VLOOKUP(INDIRECT($A$5&ROW($A801)),'State Lookup'!$A:$B,2,FALSE),\"\")","v":""}]
[null,"",{"$f":"IFERROR(VLOOKUP(INDIRECT($A$5&ROW($A802)),'State Lookup'!$A:$B,2,FALSE),\"\")","v":""}]
[null,"",{"$f":"IFERROR(VLOOKUP(INDIRECT($A$5&ROW($A803)),'State Lookup'!$A:$B,2,FALSE),\"\")","v":""}]
[null,"",{"$f":"IFERROR(VLOOKUP(INDIRECT($A$5&ROW($A804)),'State Lookup'!$A:$B,2,FALSE),\"\")","v":""}]
[null,"",{"$f":"IFERROR(VLOOKUP(INDIRECT($A$5&ROW($A805)),'State Lookup'!$A:$B,2,FALSE),\"\")","v":""}]
[null,"",{"$f":"IFERROR(VLOOKUP(INDIRECT($A$5&ROW($A806)),'State Lookup'!$A:$B,2,FALSE),\"\")","v":""}]
[null,"",{"$f":"IFERROR(VLOOKUP(INDIRECT($A$5&ROW($A807)),'State Lookup'!$A:$B,2,FALSE),\"\")","v":""}]
[null,"",{"$f":"IFERROR(VLOOKUP(INDIRECT($A$5&ROW($A808)),'State Lookup'!$A:$B,2,FALSE),\"\")","v":""}]
[null,"",{"$f":"IFERROR(VLOOKUP(INDIRECT($A$5&ROW($A809)),'State Lookup'!$A:$B,2,FALSE),\"\")","v":""}]
[null,"",{"$f":"IFERROR(VLOOKUP(INDIRECT($A$5&ROW($A810)),'State Lookup'!$A:$B,2,FALSE),\"\")","v":""}]
[null,"",{"$f":"IFERROR(VLOOKUP(INDIRECT($A$5&ROW($A811)),'State Lookup'!$A:$B,2,FALSE),\"\")","v":""}]
[null,"",{"$f":"IFERROR(VLOOKUP(INDIRECT($A$5&ROW($A812)),'State Lookup'!$A:$B,2,FALSE),\"\")","v":""}]
[null,"",{"$f":"IFERROR(VLOOKUP(INDIRECT($A$5&ROW($A813)),'State Lookup'!$A:$B,2,FALSE),\"\")","v":""}]
[null,"",{"$f":"IFERROR(VLOOKUP(INDIRECT($A$5&ROW($A814)),'State Lookup'!$A:$B,2,FALSE),\"\")","v":""}]
[null,"",{"$f":"IFERROR(VLOOKUP(INDIRECT($A$5&ROW($A815)),'State Lookup'!$A:$B,2,FALSE),\"\")","v":""}]
[null,"",{"$f":"IFERROR(VLOOKUP(INDIRECT($A$5&ROW($A816)),'State Lookup'!$A:$B,2,FALSE),\"\")","v":""}]
[null,"",{"$f":"IFERROR(VLOOKUP(INDIRECT($A$5&ROW($A817)),'State Lookup'!$A:$B,2,FALSE),\"\")","v":""}]
[null,"",{"$f":"IFERROR(VLOOKUP(INDIRECT($A$5&ROW($A818)),'State Lookup'!$A:$B,2,FALSE),\"\")","v":""}]
[null,"",{"$f":"IFERROR(VLOOKUP(INDIRECT($A$5&ROW($A819)),'State Lookup'!$A:$B,2,FALSE),\"\")","v":""}]
[null,"",{"$f":"IFERROR(VLOOKUP(INDIRECT($A$5&ROW($A820)),'State Lookup'!$A:$B,2,FALSE),\"\")","v":""}]
[null,"",{"$f":"IFERROR(VLOOKUP(INDIRECT($A$5&ROW($A821)),'State Lookup'!$A:$B,2,FALSE),\"\")","v":""}]
[null,"",{"$f":"IFERROR(VLOOKUP(INDIRECT($A$5&ROW($A822)),'State Lookup'!$A:$B,2,FALSE),\"\")","v":""}]
[null,"",{"$f":"IFERROR(VLOOKUP(INDIRECT($A$5&ROW($A823)),'State Lookup'!$A:$B,2,FALSE),\"\")","v":""}]
[null,"",{"$f":"IFERROR(VLOOKUP(INDIRECT($A$5&ROW($A824)),'State Lookup'!$A:$B,2,FALSE),\"\")","v":""}]
[null,"",{"$f":"IFERROR(VLOOKUP(INDIRECT($A$5&ROW($A825)),'State Lookup'!$A:$B,2,FALSE),\"\")","v":""}]
[null,"",{"$f":"IFERROR(VLOOKUP(INDIRECT($A$5&ROW($A826)),'State Lookup'!$A:$B,2,FALSE),\"\")","v":""}]
[null,"",{"$f":"IFERROR(VLOOKUP(INDIRECT($A$5&ROW($A827)),'State Lookup'!$A:$B,2,FALSE),\"\")","v":""}]
[null,"",{"$f":"IFERROR(VLOOKUP(INDIRECT($A$5&ROW($A828)),'State Lookup'!$A:$B,2,FALSE),\"\")","v":""}]
[null,"",{"$f":"IFERROR(VLOOKUP(INDIRECT($A$5&ROW($A829)),'State Lookup'!$A:$B,2,FALSE),\"\")","v":""}]
[null,"",{"$f":"IFERROR(VLOOKUP(INDIRECT($A$5&ROW($A830)),'State Lookup'!$A:$B,2,FALSE),\"\")","v":""}]
[null,"",{"$f":"IFERROR(VLOOKUP(INDIRECT($A$5&ROW($A831)),'State Lookup'!$A:$B,2,FALSE),\"\")","v":""}]
[null,"",{"$f":"IFERROR(VLOOKUP(INDIRECT($A$5&ROW($A832)),'State Lookup'!$A:$B,2,FALSE),\"\")","v":""}]
[null,"",{"$f":"IFERROR(VLOOKUP(INDIRECT($A$5&ROW($A833)),'State Lookup'!$A:$B,2,FALSE),\"\")","v":""}]
[null,"",{"$f":"IFERROR(VLOOKUP(INDIRECT($A$5&ROW($A834)),'State Lookup'!$A:$B,2,FALSE),\"\")","v":""}]
[null,{"$f":"IFERROR((INDIRECT($A$3&ROW($A835))/INDIRECT($A$1&ROW($A835)))*100,\"\")","v":""},{"$f":"IFERROR(VLOOKUP(INDIRECT($A$5&ROW($A835)),'State Lookup'!$A:$B,2,FALSE),\"\")","v":""}]
[null,"",{"$f":"IFERROR(VLOOKUP(INDIRECT($A$5&ROW($A836)),'State Lookup'!$A:$B,2,FALSE),\"\")","v":""}]
[null,"",{"$f":"IFERROR(VLOOKUP(INDIRECT($A$5&ROW($A837)),'State Lookup'!$A:$B,2,FALSE),\"\")","v":""}]
[null,"",{"$f":"IFERROR(VLOOKUP(INDIRECT($A$5&ROW($A838)),'State Lookup'!$A:$B,2,FALSE),\"\")","v":""}]
[null,"",{"$f":"IFERROR(VLOOKUP(INDIRECT($A$5&ROW($A839)),'State Lookup'!$A:$B,2,FALSE),\"\")","v":""}]
[null,"",{"$f":"IFERROR(VLOOKUP(INDIRECT($A$5&ROW($A840)),'State Lookup'!$A:$B,2,FALSE),\"\")","v":""}]
[null,"",{"$f":"IFERROR(VLOOKUP(INDIRECT($A$5&ROW($A841)),'State Lookup'!$A:$B,2,FALSE),\"\")","v":""}]
[null,"",{"$f":"IFERROR(VLOOKUP(INDIRECT($A$5&ROW($A842)),'State Lookup'!$A:$B,2,FALSE),\"\")","v":""}]
[null,"",{"$f":"IFERROR(VLOOKUP(INDIRECT($A$5&ROW($A843)),'State Lookup'!$A:$B,2,FALSE),\"\")","v":""}]
[null,"",{"$f":"IFERROR(VLOOKUP(INDIRECT($A$5&ROW($A844)),'State Lookup'!$A:$B,2,FALSE),\"\")","v":""}]
[null,"",{"$f":"IFERROR(VLOOKUP(INDIRECT($A$5&ROW($A845)),'State Lookup'!$A:$B,2,FALSE),\"\")","v":""}]
[null,"",{"$f":"IFERROR(VLOOKUP(INDIRECT($A$5&ROW($A846)),'State Lookup'!$A:$B,2,FALSE),\"\")","v":""}]
[null,"",{"$f":"IFERROR(VLOOKUP(INDIRECT($A$5&ROW($A847)),'State Lookup'!$A:$B,2,FALSE),\"\")","v":""}]
[null,"",{"$f":"IFERROR(VLOOKUP(INDIRECT($A$5&ROW($A848)),'State Lookup'!$A:$B,2,FALSE),\"\")","v":""}]
[null,"",{"$f":"IFERROR(VLOOKUP(INDIRECT($A$5&ROW($A849)),'State Lookup'!$A:$B,2,FALSE),\"\")","v":""}]
[null,"",{"$f":"IFERROR(VLOOKUP(INDIRECT($A$5&ROW($A850)),'State Lookup'!$A:$B,2,FALSE),\"\")","v":""}]
[null,"",{"$f":"IFERROR(VLOOKUP(INDIRECT($A$5&ROW($A851)),'State Lookup'!$A:$B,2,FALSE),\"\")","v":""}]
[null,"",{"$f":"IFERROR(VLOOKUP(INDIRECT($A$5&ROW($A852)),'State Lookup'!$A:$B,2,FALSE),\"\")","v":""}]
[null,"",{"$f":"IFERROR(VLOOKUP(INDIRECT($A$5&ROW($A853)),'State Lookup'!$A:$B,2,FALSE),\"\")","v":""}]
[null,"",{"$f":"IFERROR(VLOOKUP(INDIRECT($A$5&ROW($A854)),'State Lookup'!$A:$B,2,FALSE),\"\")","v":""}]
[null,"",{"$f":"IFERROR(VLOOKUP(INDIRECT($A$5&ROW($A855)),'State Lookup'!$A:$B,2,FALSE),\"\")","v":""}]
[null,"",{"$f":"IFERROR(VLOOKUP(INDIRECT($A$5&ROW($A856)),'State Lookup'!$A:$B,2,FALSE),\"\")","v":""}]
[null,"",{"$f":"IFERROR(VLOOKUP(INDIRECT($A$5&ROW($A857)),'State Lookup'!$A:$B,2,FALSE),\"\")","v":""}]
[null,"",{"$f":"IFERROR(VLOOKUP(INDIRECT($A$5&ROW($A858)),'State Lookup'!$A:$B,2,FALSE),\"\")","v":""}]
[null,"",{"$f":"IFERROR(VLOOKUP(INDIRECT($A$5&ROW($A859)),'State Lookup'!$A:$B,2,FALSE),\"\")","v":""}]
[null,"",{"$f":"IFERROR(VLOOKUP(INDIRECT($A$5&ROW($A860)),'State Lookup'!$A:$B,2,FALSE),\"\")","v":""}]
[null,"",{"$f":"IFERROR(VLOOKUP(INDIRECT($A$5&ROW($A861)),'State Lookup'!$A:$B,2,FALSE),\"\")","v":""}]
[null,"",{"$f":"IFERROR(VLOOKUP(INDIRECT($A$5&ROW($A862)),'State Lookup'!$A:$B,2,FALSE),\"\")","v":""}]
[null,"",{"$f":"IFERROR(VLOOKUP(INDIRECT($A$5&ROW($A863)),'State Lookup'!$A:$B,2,FALSE),\"\")","v":""}]
[null,"",{"$f":"IFERROR(VLOOKUP(INDIRECT($A$5&ROW($A864)),'State Lookup'!$A:$B,2,FALSE),\"\")","v":""}]
[null,"",{"$f":"IFERROR(VLOOKUP(INDIRECT($A$5&ROW($A865)),'State Lookup'!$A:$B,2,FALSE),\"\")","v":""}]
[null,"",{"$f":"IFERROR(VLOOKUP(INDIRECT($A$5&ROW($A866)),'State Lookup'!$A:$B,2,FALSE),\"\")","v":""}]
[null,"",{"$f":"IFERROR(VLOOKUP(INDIRECT($A$5&ROW($A867)),'State Lookup'!$A:$B,2,FALSE),\"\")","v":""}]
[null,"",{"$f":"IFERROR(VLOOKUP(INDIRECT($A$5&ROW($A868)),'State Lookup'!$A:$B,2,FALSE),\"\")","v":""}]
[null,"",{"$f":"IFERROR(VLOOKUP(INDIRECT($A$5&ROW($A869)),'State Lookup'!$A:$B,2,FALSE),\"\")","v":""}]
[null,"",{"$f":"IFERROR(VLOOKUP(INDIRECT($A$5&ROW($A870)),'State Lookup'!$A:$B,2,FALSE),\"\")","v":""}]
[null,"",{"$f":"IFERROR(VLOOKUP(INDIRECT($A$5&ROW($A871)),'State Lookup'!$A:$B,2,FALSE),\"\")","v":""}]
[null,"",{"$f":"IFERROR(VLOOKUP(INDIRECT($A$5&ROW($A872)),'State Lookup'!$A:$B,2,FALSE),\"\")","v":""}]
[null,"",{"$f":"IFERROR(VLOOKUP(INDIRECT($A$5&ROW($A873)),'State Lookup'!$A:$B,2,FALSE),\"\")","v":""}]
[null,"",{"$f":"IFERROR(VLOOKUP(INDIRECT($A$5&ROW($A874)),'State Lookup'!$A:$B,2,FALSE),\"\")","v":""}]
[null,"",{"$f":"IFERROR(VLOOKUP(INDIRECT($A$5&ROW($A875)),'State Lookup'!$A:$B,2,FALSE),\"\")","v":""}]
[null,"",{"$f":"IFERROR(VLOOKUP(INDIRECT($A$5&ROW($A876)),'State Lookup'!$A:$B,2,FALSE),\"\")","v":""}]
[null,"",{"$f":"IFERROR(VLOOKUP(INDIRECT($A$5&ROW($A877)),'State Lookup'!$A:$B,2,FALSE),\"\")","v":""}]
[null,"",{"$f":"IFERROR(VLOOKUP(INDIRECT($A$5&ROW($A878)),'State Lookup'!$A:$B,2,FALSE),\"\")","v":""}]
[null,"",{"$f":"IFERROR(VLOOKUP(INDIRECT($A$5&ROW($A879)),'State Lookup'!$A:$B,2,FALSE),\"\")","v":""}]
[null,"",{"$f":"IFERROR(VLOOKUP(INDIRECT($A$5&ROW($A880)),'State Lookup'!$A:$B,2,FALSE),\"\")","v":""}]
[null,"",{"$f":"IFERROR(VLOOKUP(INDIRECT($A$5&ROW($A881)),'State Lookup'!$A:$B,2,FALSE),\"\")","v":""}]
[null,"",{"$f":"IFERROR(VLOOKUP(INDIRECT($A$5&ROW($A882)),'State Lookup'!$A:$B,2,FALSE),\"\")","v":""}]
[null,"",{"$f":"IFERROR(VLOOKUP(INDIRECT($A$5&ROW($A883)),'State Lookup'!$A:$B,2,FALSE),\"\")","v":""}]
[null,"",{"$f":"IFERROR(VLOOKUP(INDIRECT($A$5&ROW($A884)),'State Lookup'!$A:$B,2,FALSE),\"\")","v":""}]
[null,"",{"$f":"IFERROR(VLOOKUP(INDIRECT($A$5&ROW($A885)),'State Lookup'!$A:$B,2,FALSE),\"\")","v":""}]
[null,"",{"$f":"IFERROR(VLOOKUP(INDIRECT($A$5&ROW($A886)),'State Lookup'!$A:$B,2,FALSE),\"\")","v":""}]
[null,"",{"$f":"IFERROR(VLOOKUP(INDIRECT($A$5&ROW($A887)),'State Lookup'!$A:$B,2,FALSE),\"\")","v":""}]
[null,"",{"$f":"IFERROR(VLOOKUP(INDIRECT($A$5&ROW($A888)),'State Lookup'!$A:$B,2,FALSE),\"\")","v":""}]
[null,"",{"$f":"IFERROR(VLOOKUP(INDIRECT($A$5&ROW($A889)),'State Lookup'!$A:$B,2,FALSE),\"\")","v":""}]
[null,"",{"$f":"IFERROR(VLOOKUP(INDIRECT($A$5&ROW($A890)),'State Lookup'!$A:$B,2,FALSE),\"\")","v":""}]
[null,"",{"$f":"IFERROR(VLOOKUP(INDIRECT($A$5&ROW($A891)),'State Lookup'!$A:$B,2,FALSE),\"\")","v":""}]
[null,"",{"$f":"IFERROR(VLOOKUP(INDIRECT($A$5&ROW($A892)),'State Lookup'!$A:$B,2,FALSE),\"\")","v":""}]
[null,"",{"$f":"IFERROR(VLOOKUP(INDIRECT($A$5&ROW($A893)),'State Lookup'!$A:$B,2,FALSE),\"\")","v":""}]
[null,"",{"$f":"IFERROR(VLOOKUP(INDIRECT($A$5&ROW($A894)),'State Lookup'!$A:$B,2,FALSE),\"\")","v":""}]
[null,"",{"$f":"IFERROR(VLOOKUP(INDIRECT($A$5&ROW($A895)),'State Lookup'!$A:$B,2,FALSE),\"\")","v":""}]
[null,"",{"$f":"IFERROR(VLOOKUP(INDIRECT($A$5&ROW($A896)),'State Lookup'!$A:$B,2,FALSE),\"\")","v":""}]
[null,"",{"$f":"IFERROR(VLOOKUP(INDIRECT($A$5&ROW($A897)),'State Lookup'!$A:$B,2,FALSE),\"\")","v":""}]
[null,"",{"$f":"IFERROR(VLOOKUP(INDIRECT($A$5&ROW($A898)),'State Lookup'!$A:$B,2,FALSE),\"\")","v":""}]
[null,{"$f":"IFERROR((INDIRECT($A$3&ROW($A899))/INDIRECT($A$1&ROW($A899)))*100,\"\")","v":""},{"$f":"IFERROR(VLOOKUP(INDIRECT($A$5&ROW($A899)),'State Lookup'!$A:$B,2,FALSE),\"\")","v":""}]
[null,"",{"$f":"IFERROR(VLOOKUP(INDIRECT($A$5&ROW($A900)),'State Lookup'!$A:$B,2,FALSE),\"\")","v":""}]
[null,"",{"$f":"IFERROR(VLOOKUP(INDIRECT($A$5&ROW($A901)),'State Lookup'!$A:$B,2,FALSE),\"\")","v":""}]
[null,"",{"$f":"IFERROR(VLOOKUP(INDIRECT($A$5&ROW($A902)),'State Lookup'!$A:$B,2,FALSE),\"\")","v":""}]
[null,"",{"$f":"IFERROR(VLOOKUP(INDIRECT($A$5&ROW($A903)),'State Lookup'!$A:$B,2,FALSE),\"\")","v":""}]
[null,"",{"$f":"IFERROR(VLOOKUP(INDIRECT($A$5&ROW($A904)),'State Lookup'!$A:$B,2,FALSE),\"\")","v":""}]
[null,"",{"$f":"IFERROR(VLOOKUP(INDIRECT($A$5&ROW($A905)),'State Lookup'!$A:$B,2,FALSE),\"\")","v":""}]
[null,"",{"$f":"IFERROR(VLOOKUP(INDIRECT($A$5&ROW($A906)),'State Lookup'!$A:$B,2,FALSE),\"\")","v":""}]
[null,"",{"$f":"IFERROR(VLOOKUP(INDIRECT($A$5&ROW($A907)),'State Lookup'!$A:$B,2,FALSE),\"\")","v":""}]
[null,"",{"$f":"IFERROR(VLOOKUP(INDIRECT($A$5&ROW($A908)),'State Lookup'!$A:$B,2,FALSE),\"\")","v":""}]
[null,"",{"$f":"IFERROR(VLOOKUP(INDIRECT($A$5&ROW($A909)),'State Lookup'!$A:$B,2,FALSE),\"\")","v":""}]
[null,"",{"$f":"IFERROR(VLOOKUP(INDIRECT($A$5&ROW($A910)),'State Lookup'!$A:$B,2,FALSE),\"\")","v":""}]
[null,"",{"$f":"IFERROR(VLOOKUP(INDIRECT($A$5&ROW($A911)),'State Lookup'!$A:$B,2,FALSE),\"\")","v":""}]
[null,"",{"$f":"IFERROR(VLOOKUP(INDIRECT($A$5&ROW($A912)),'State Lookup'!$A:$B,2,FALSE),\"\")","v":""}]
[null,"",{"$f":"IFERROR(VLOOKUP(INDIRECT($A$5&ROW($A913)),'State Lookup'!$A:$B,2,FALSE),\"\")","v":""}]
[null,"",{"$f":"IFERROR(VLOOKUP(INDIRECT($A$5&ROW($A914)),'State Lookup'!$A:$B,2,FALSE),\"\")","v":""}]
[null,"",{"$f":"IFERROR(VLOOKUP(INDIRECT($A$5&ROW($A915)),'State Lookup'!$A:$B,2,FALSE),\"\")","v":""}]
[null,"",{"$f":"IFERROR(VLOOKUP(INDIRECT($A$5&ROW($A916)),'State Lookup'!$A:$B,2,FALSE),\"\")","v":""}]
[null,"",{"$f":"IFERROR(VLOOKUP(INDIRECT($A$5&ROW($A917)),'State Lookup'!$A:$B,2,FALSE),\"\")","v":""}]
[null,"",{"$f":"IFERROR(VLOOKUP(INDIRECT($A$5&ROW($A918)),'State Lookup'!$A:$B,2,FALSE),\"\")","v":""}]
[null,"",{"$f":"IFERROR(VLOOKUP(INDIRECT($A$5&ROW($A919)),'State Lookup'!$A:$B,2,FALSE),\"\")","v":""}]
[null,"",{"$f":"IFERROR(VLOOKUP(INDIRECT($A$5&ROW($A920)),'State Lookup'!$A:$B,2,FALSE),\"\")","v":""}]
[null,"",{"$f":"IFERROR(VLOOKUP(INDIRECT($A$5&ROW($A921)),'State Lookup'!$A:$B,2,FALSE),\"\")","v":""}]
[null,"",{"$f":"IFERROR(VLOOKUP(INDIRECT($A$5&ROW($A922)),'State Lookup'!$A:$B,2,FALSE),\"\")","v":""}]
[null,"",{"$f":"IFERROR(VLOOKUP(INDIRECT($A$5&ROW($A923)),'State Lookup'!$A:$B,2,FALSE),\"\")","v":""}]
[null,"",{"$f":"IFERROR(VLOOKUP(INDIRECT($A$5&ROW($A924)),'State Lookup'!$A:$B,2,FALSE),\"\")","v":""}]
[null,"",{"$f":"IFERROR(VLOOKUP(INDIRECT($A$5&ROW($A925)),'State Lookup'!$A:$B,2,FALSE),\"\")","v":""}]
[null,"",{"$f":"IFERROR(VLOOKUP(INDIRECT($A$5&ROW($A926)),'State Lookup'!$A:$B,2,FALSE),\"\")","v":""}]
[null,"",{"$f":"IFERROR(VLOOKUP(INDIRECT($A$5&ROW($A927)),'State Lookup'!$A:$B,2,FALSE),\"\")","v":""}]
[null,"",{"$f":"IFERROR(VLOOKUP(INDIRECT($A$5&ROW($A928)),'State Lookup'!$A:$B,2,FALSE),\"\")","v":""}]
[null,"",{"$f":"IFERROR(VLOOKUP(INDIRECT($A$5&ROW($A929)),'State Lookup'!$A:$B,2,FALSE),\"\")","v":""}]
[null,"",{"$f":"IFERROR(VLOOKUP(INDIRECT($A$5&ROW($A930)),'State Lookup'!$A:$B,2,FALSE),\"\")","v":""}]
[null,"",{"$f":"IFERROR(VLOOKUP(INDIRECT($A$5&ROW($A931)),'State Lookup'!$A:$B,2,FALSE),\"\")","v":""}]
[null,"",{"$f":"IFERROR(VLOOKUP(INDIRECT($A$5&ROW($A932)),'State Lookup'!$A:$B,2,FALSE),\"\")","v":""}]
[null,"",{"$f":"IFERROR(VLOOKUP(INDIRECT($A$5&ROW($A933)),'State Lookup'!$A:$B,2,FALSE),\"\")","v":""}]
[null,"",{"$f":"IFERROR(VLOOKUP(INDIRECT($A$5&ROW($A934)),'State Lookup'!$A:$B,2,FALSE),\"\")","v":""}]
[null,"",{"$f":"IFERROR(VLOOKUP(INDIRECT($A$5&ROW($A935)),'State Lookup'!$A:$B,2,FALSE),\"\")","v":""}]
[null,"",{"$f":"IFERROR(VLOOKUP(INDIRECT($A$5&ROW($A936)),'State Lookup'!$A:$B,2,FALSE),\"\")","v":""}]
[null,"",{"$f":"IFERROR(VLOOKUP(INDIRECT($A$5&ROW($A937)),'State Lookup'!$A:$B,2,FALSE),\"\")","v":""}]
[null,"",{"$f":"IFERROR(VLOOKUP(INDIRECT($A$5&ROW($A938)),'State Lookup'!$A:$B,2,FALSE),\"\")","v":""}]
[null,"",{"$f":"IFERROR(VLOOKUP(INDIRECT($A$5&ROW($A939)),'State Lookup'!$A:$B,2,FALSE),\"\")","v":""}]
[null,"",{"$f":"IFERROR(VLOOKUP(INDIRECT($A$5&ROW($A940)),'State Lookup'!$A:$B,2,FALSE),\"\")","v":""}]
[null,"",{"$f":"IFERROR(VLOOKUP(INDIRECT($A$5&ROW($A941)),'State Lookup'!$A:$B,2,FALSE),\"\")","v":""}]
[null,"",{"$f":"IFERROR(VLOOKUP(INDIRECT($A$5&ROW($A942)),'State Lookup'!$A:$B,2,FALSE),\"\")","v":""}]
[null,"",{"$f":"IFERROR(VLOOKUP(INDIRECT($A$5&ROW($A943)),'State Lookup'!$A:$B,2,FALSE),\"\")","v":""}]
[null,"",{"$f":"IFERROR(VLOOKUP(INDIRECT($A$5&ROW($A944)),'State Lookup'!$A:$B,2,FALSE),\"\")","v":""}]
[null,"",{"$f":"IFERROR(VLOOKUP(INDIRECT($A$5&ROW($A945)),'State Lookup'!$A:$B,2,FALSE),\"\")","v":""}]
[null,"",{"$f":"IFERROR(VLOOKUP(INDIRECT($A$5&ROW($A946)),'State Lookup'!$A:$B,2,FALSE),\"\")","v":""}]
[null,"",{"$f":"IFERROR(VLOOKUP(INDIRECT($A$5&ROW($A947)),'State Lookup'!$A:$B,2,FALSE),\"\")","v":""}]
[null,"",{"$f":"IFERROR(VLOOKUP(INDIRECT($A$5&ROW($A948)),'State Lookup'!$A:$B,2,FALSE),\"\")","v":""}]
[null,"",{"$f":"IFERROR(VLOOKUP(INDIRECT($A$5&ROW($A949)),'State Lookup'!$A:$B,2,FALSE),\"\")","v":""}]
[null,"",{"$f":"IFERROR(VLOOKUP(INDIRECT($A$5&ROW($A950)),'State Lookup'!$A:$B,2,FALSE),\"\")","v":""}]
[null,"",{"$f":"IFERROR(VLOOKUP(INDIRECT($A$5&ROW($A951)),'State Lookup'!$A:$B,2,FALSE),\"\")","v":""}]
[null,"",{"$f":"IFERROR(VLOOKUP(INDIRECT($A$5&ROW($A952)),'State Lookup'!$A:$B,2,FALSE),\"\")","v":""}]
[null,"",{"$f":"IFERROR(VLOOKUP(INDIRECT($A$5&ROW($A953)),'State Lookup'!$A:$B,2,FALSE),\"\")","v":""}]
[null,"",{"$f":"IFERROR(VLOOKUP(INDIRECT($A$5&ROW($A954)),'State Lookup'!$A:$B,2,FALSE),\"\")","v":""}]
[null,"",{"$f":"IFERROR(VLOOKUP(INDIRECT($A$5&ROW($A955)),'State Lookup'!$A:$B,2,FALSE),\"\")","v":""}]
[null,"",{"$f":"IFERROR(VLOOKUP(INDIRECT($A$5&ROW($A956)),'State Lookup'!$A:$B,2,FALSE),\"\")","v":""}]
[null,"",{"$f":"IFERROR(VLOOKUP(INDIRECT($A$5&ROW($A957)),'State Lookup'!$A:$B,2,FALSE),\"\")","v":""}]
[null,"",{"$f":"IFERROR(VLOOKUP(INDIRECT($A$5&ROW($A958)),'State Lookup'!$A:$B,2,FALSE),\"\")","v":""}]
[null,"",{"$f":"IFERROR(VLOOKUP(INDIRECT($A$5&ROW($A959)),'State Lookup'!$A:$B,2,FALSE),\"\")","v":""}]
[null,"",{"$f":"IFERROR(VLOOKUP(INDIRECT($A$5&ROW($A960)),'State Lookup'!$A:$B,2,FALSE),\"\")","v":""}]
[null,"",{"$f":"IFERROR(VLOOKUP(INDIRECT($A$5&ROW($A961)),'State Lookup'!$A:$B,2,FALSE),\"\")","v":""}]
[null,"",{"$f":"IFERROR(VLOOKUP(INDIRECT($A$5&ROW($A962)),'State Lookup'!$A:$B,2,FALSE),\"\")","v":""}]
[null,{"$f":"IFERROR((INDIRECT($A$3&ROW($A963))/INDIRECT($A$1&ROW($A963)))*100,\"\")","v":""},{"$f":"IFERROR(VLOOKUP(INDIRECT($A$5&ROW($A963)),'State Lookup'!$A:$B,2,FALSE),\"\")","v":""}]
[null,"",{"$f":"IFERROR(VLOOKUP(INDIRECT($A$5&ROW($A964)),'State Lookup'!$A:$B,2,FALSE),\"\")","v":""}]
[null,"",{"$f":"IFERROR(VLOOKUP(INDIRECT($A$5&ROW($A965)),'State Lookup'!$A:$B,2,FALSE),\"\")","v":""}]
[null,"",{"$f":"IFERROR(VLOOKUP(INDIRECT($A$5&ROW($A966)),'State Lookup'!$A:$B,2,FALSE),\"\")","v":""}]
[null,"",{"$f":"IFERROR(VLOOKUP(INDIRECT($A$5&ROW($A967)),'State Lookup'!$A:$B,2,FALSE),\"\")","v":""}]
[null,"",{"$f":"IFERROR(VLOOKUP(INDIRECT($A$5&ROW($A968)),'State Lookup'!$A:$B,2,FALSE),\"\")","v":""}]
[null,"",{"$f":"IFERROR(VLOOKUP(INDIRECT($A$5&ROW($A969)),'State Lookup'!$A:$B,2,FALSE),\"\")","v":""}]
[null,"",{"$f":"IFERROR(VLOOKUP(INDIRECT($A$5&ROW($A970)),'State Lookup'!$A:$B,2,FALSE),\"\")","v":""}]
[null,"",{"$f":"IFERROR(VLOOKUP(INDIRECT($A$5&ROW($A971)),'State Lookup'!$A:$B,2,FALSE),\"\")","v":""}]
[null,"",{"$f":"IFERROR(VLOOKUP(INDIRECT($A$5&ROW($A972)),'State Lookup'!$A:$B,2,FALSE),\"\")","v":""}]
[null,"",{"$f":"IFERROR(VLOOKUP(INDIRECT($A$5&ROW($A973)),'State Lookup'!$A:$B,2,FALSE),\"\")","v":""}]
[null,"",{"$f":"IFERROR(VLOOKUP(INDIRECT($A$5&ROW($A974)),'State Lookup'!$A:$B,2,FALSE),\"\")","v":""}]
[null,"",{"$f":"IFERROR(VLOOKUP(INDIRECT($A$5&ROW($A975)),'State Lookup'!$A:$B,2,FALSE),\"\")","v":""}]
[null,"",{"$f":"IFERROR(VLOOKUP(INDIRECT($A$5&ROW($A976)),'State Lookup'!$A:$B,2,FALSE),\"\")","v":""}]
[null,"",{"$f":"IFERROR(VLOOKUP(INDIRECT($A$5&ROW($A977)),'State Lookup'!$A:$B,2,FALSE),\"\")","v":""}]
[null,"",{"$f":"IFERROR(VLOOKUP(INDIRECT($A$5&ROW($A978)),'State Lookup'!$A:$B,2,FALSE),\"\")","v":""}]
[null,"",{"$f":"IFERROR(VLOOKUP(INDIRECT($A$5&ROW($A979)),'State Lookup'!$A:$B,2,FALSE),\"\")","v":""}]
[null,"",{"$f":"IFERROR(VLOOKUP(INDIRECT($A$5&ROW($A980)),'State Lookup'!$A:$B,2,FALSE),\"\")","v":""}]
[null,"",{"$f":"IFERROR(VLOOKUP(INDIRECT($A$5&ROW($A981)),'State Lookup'!$A:$B,2,FALSE),\"\")","v":""}]
[null,"",{"$f":"IFERROR(VLOOKUP(INDIRECT($A$5&ROW($A982)),'State Lookup'!$A:$B,2,FALSE),\"\")","v":""}]
[null,"",{"$f":"IFERROR(VLOOKUP(INDIRECT($A$5&ROW($A983)),'State Lookup'!$A:$B,2,FALSE),\"\")","v":""}]
[null,"",{"$f":"IFERROR(VLOOKUP(INDIRECT($A$5&ROW($A984)),'State Lookup'!$A:$B,2,FALSE),\"\")","v":""}]
[null,"",{"$f":"IFERROR(VLOOKUP(INDIRECT($A$5&ROW($A985)),'State Lookup'!$A:$B,2,FALSE),\"\")","v":""}]
[null,"",{"$f":"IFERROR(VLOOKUP(INDIRECT($A$5&ROW($A986)),'State Lookup'!$A:$B,2,FALSE),\"\")","v":""}]
[null,"",{"$f":"IFERROR(VLOOKUP(INDIRECT($A$5&ROW($A987)),'State Lookup'!$A:$B,2,FALSE),\"\")","v":""}]
[null,"",{"$f":"IFERROR(VLOOKUP(INDIRECT($A$5&ROW($A988)),'State Lookup'!$A:$B,2,FALSE),\"\")","v":""}]
[null,"",{"$f":"IFERROR(VLOOKUP(INDIRECT($A$5&ROW($A989)),'State Lookup'!$A:$B,2,FALSE),\"\")","v":""}]
[null,"",{"$f":"IFERROR(VLOOKUP(INDIRECT($A$5&ROW($A990)),'State Lookup'!$A:$B,2,FALSE),\"\")","v":""}]
[null,"",{"$f":"IFERROR(VLOOKUP(INDIRECT($A$5&ROW($A991)),'State Lookup'!$A:$B,2,FALSE),\"\")","v":""}]
[null,"",{"$f":"IFERROR(VLOOKUP(INDIRECT($A$5&ROW($A992)),'State Lookup'!$A:$B,2,FALSE),\"\")","v":""}]
[null,"",{"$f":"IFERROR(VLOOKUP(INDIRECT($A$5&ROW($A993)),'State Lookup'!$A:$B,2,FALSE),\"\")","v":""}]
[null,"",{"$f":"IFERROR(VLOOKUP(INDIRECT($A$5&ROW($A994)),'State Lookup'!$A:$B,2,FALSE),\"\")","v":""}]
[null,"",{"$f":"IFERROR(VLOOKUP(INDIRECT($A$5&ROW($A995)),'State Lookup'!$A:$B,2,FALSE),\"\")","v":""}]
[null,"",{"$f":"IFERROR(VLOOKUP(INDIRECT($A$5&ROW($A996)),'State Lookup'!$A:$B,2,FALSE),\"\")","v":""}]
[null,"",{"$f":"IFERROR(VLOOKUP(INDIRECT($A$5&ROW($A997)),'State Lookup'!$A:$B,2,FALSE),\"\")","v":""}]
[null,"",{"$f":"IFERROR(VLOOKUP(INDIRECT($A$5&ROW($A998)),'State Lookup'!$A:$B,2,FALSE),\"\")","v":""}]
[null,"",{"$f":"IFERROR(VLOOKUP(INDIRECT($A$5&ROW($A999)),'State Lookup'!$A:$B,2,FALSE),\"\")","v":""}]
[null,"",{"$f":"IFERROR(VLOOKUP(INDIRECT($A$5&ROW($A1000)),'State Lookup'!$A:$B,2,FALSE),\"\")","v":""}]
[null,"",{"$f":"IFERROR(VLOOKUP(INDIRECT($A$5&ROW($A1001)),'State Lookup'!$A:$B,2,FALSE),\"\")","v":""}]
[null,"",{"$f":"IFERROR(VLOOKUP(INDIRECT($A$5&ROW($A1002)),'State Lookup'!$A:$B,2,FALSE),\"\")","v":""}]
[null,"",{"$f":"IFERROR(VLOOKUP(INDIRECT($A$5&ROW($A1003)),'State Lookup'!$A:$B,2,FALSE),\"\")","v":""}]
[null,"",{"$f":"IFERROR(VLOOKUP(INDIRECT($A$5&ROW($A1004)),'State Lookup'!$A:$B,2,FALSE),\"\")","v":""}]
[null,"",{"$f":"IFERROR(VLOOKUP(INDIRECT($A$5&ROW($A1005)),'State Lookup'!$A:$B,2,FALSE),\"\")","v":""}]
[null,"",{"$f":"IFERROR(VLOOKUP(INDIRECT($A$5&ROW($A1006)),'State Lookup'!$A:$B,2,FALSE),\"\")","v":""}]
[null,"",{"$f":"IFERROR(VLOOKUP(INDIRECT($A$5&ROW($A1007)),'State Lookup'!$A:$B,2,FALSE),\"\")","v":""}]
[null,"",{"$f":"IFERROR(VLOOKUP(INDIRECT($A$5&ROW($A1008)),'State Lookup'!$A:$B,2,FALSE),\"\")","v":""}]
[null,"",{"$f":"IFERROR(VLOOKUP(INDIRECT($A$5&ROW($A1009)),'State Lookup'!$A:$B,2,FALSE),\"\")","v":""}]
[null,"",{"$f":"IFERROR(VLOOKUP(INDIRECT($A$5&ROW($A1010)),'State Lookup'!$A:$B,2,FALSE),\"\")","v":""}]
[null,"",{"$f":"IFERROR(VLOOKUP(INDIRECT($A$5&ROW($A1011)),'State Lookup'!$A:$B,2,FALSE),\"\")","v":""}]
[null,"",{"$f":"IFERROR(VLOOKUP(INDIRECT($A$5&ROW($A1012)),'State Lookup'!$A:$B,2,FALSE),\"\")","v":""}]
[null,"",{"$f":"IFERROR(VLOOKUP(INDIRECT($A$5&ROW($A1013)),'State Lookup'!$A:$B,2,FALSE),\"\")","v":""}]
[null,"",{"$f":"IFERROR(VLOOKUP(INDIRECT($A$5&ROW($A1014)),'State Lookup'!$A:$B,2,FALSE),\"\")","v":""}]
[null,"",{"$f":"IFERROR(VLOOKUP(INDIRECT($A$5&ROW($A1015)),'State Lookup'!$A:$B,2,FALSE),\"\")","v":""}]
[null,"",{"$f":"IFERROR(VLOOKUP(INDIRECT($A$5&ROW($A1016)),'State Lookup'!$A:$B,2,FALSE),\"\")","v":""}]
[null,"",{"$f":"IFERROR(VLOOKUP(INDIRECT($A$5&ROW($A1017)),'State Lookup'!$A:$B,2,FALSE),\"\")","v":""}]
[null,"",{"$f":"IFERROR(VLOOKUP(INDIRECT($A$5&ROW($A1018)),'State Lookup'!$A:$B,2,FALSE),\"\")","v":""}]
[null,"",{"$f":"IFERROR(VLOOKUP(INDIRECT($A$5&ROW($A1019)),'State Lookup'!$A:$B,2,FALSE),\"\")","v":""}]
[null,"",{"$f":"IFERROR(VLOOKUP(INDIRECT($A$5&ROW($A1020)),'State Lookup'!$A:$B,2,FALSE),\"\")","v":""}]
[null,"",{"$f":"IFERROR(VLOOKUP(INDIRECT($A$5&ROW($A1021)),'State Lookup'!$A:$B,2,FALSE),\"\")","v":""}]
[null,"",{"$f":"IFERROR(VLOOKUP(INDIRECT($A$5&ROW($A1022)),'State Lookup'!$A:$B,2,FALSE),\"\")","v":""}]
[null,"",{"$f":"IFERROR(VLOOKUP(INDIRECT($A$5&ROW($A1023)),'State Lookup'!$A:$B,2,FALSE),\"\")","v":""}]
[null,"",{"$f":"IFERROR(VLOOKUP(INDIRECT($A$5&ROW($A1024)),'State Lookup'!$A:$B,2,FALSE),\"\")","v":""}]
[null,"",{"$f":"IFERROR(VLOOKUP(INDIRECT($A$5&ROW($A1025)),'State Lookup'!$A:$B,2,FALSE),\"\")","v":""}]
[null,"",{"$f":"IFERROR(VLOOKUP(INDIRECT($A$5&ROW($A1026)),'State Lookup'!$A:$B,2,FALSE),\"\")","v":""}]
[null,{"$f":"IFERROR((INDIRECT($A$3&ROW($A1027))/INDIRECT($A$1&ROW($A1027)))*100,\"\")","v":""},{"$f":"IFERROR(VLOOKUP(INDIRECT($A$5&ROW($A1027)),'State Lookup'!$A:$B,2,FALSE),\"\")","v":""}]
[null,"",{"$f":"IFERROR(VLOOKUP(INDIRECT($A$5&ROW($A1028)),'State Lookup'!$A:$B,2,FALSE),\"\")","v":""}]
[null,"",{"$f":"IFERROR(VLOOKUP(INDIRECT($A$5&ROW($A1029)),'State Lookup'!$A:$B,2,FALSE),\"\")","v":""}]
[null,"",{"$f":"IFERROR(VLOOKUP(INDIRECT($A$5&ROW($A1030)),'State Lookup'!$A:$B,2,FALSE),\"\")","v":""}]
[null,"",{"$f":"IFERROR(VLOOKUP(INDIRECT($A$5&ROW($A1031)),'State Lookup'!$A:$B,2,FALSE),\"\")","v":""}]
[null,"",{"$f":"IFERROR(VLOOKUP(INDIRECT($A$5&ROW($A1032)),'State Lookup'!$A:$B,2,FALSE),\"\")","v":""}]
[null,"",{"$f":"IFERROR(VLOOKUP(INDIRECT($A$5&ROW($A1033)),'State Lookup'!$A:$B,2,FALSE),\"\")","v":""}]
[null,"",{"$f":"IFERROR(VLOOKUP(INDIRECT($A$5&ROW($A1034)),'State Lookup'!$A:$B,2,FALSE),\"\")","v":""}]
[null,"",{"$f":"IFERROR(VLOOKUP(INDIRECT($A$5&ROW($A1035)),'State Lookup'!$A:$B,2,FALSE),\"\")","v":""}]
[null,"",{"$f":"IFERROR(VLOOKUP(INDIRECT($A$5&ROW($A1036)),'State Lookup'!$A:$B,2,FALSE),\"\")","v":""}]
[null,"",{"$f":"IFERROR(VLOOKUP(INDIRECT($A$5&ROW($A1037)),'State Lookup'!$A:$B,2,FALSE),\"\")","v":""}]
[null,"",{"$f":"IFERROR(VLOOKUP(INDIRECT($A$5&ROW($A1038)),'State Lookup'!$A:$B,2,FALSE),\"\")","v":""}]
[null,"",{"$f":"IFERROR(VLOOKUP(INDIRECT($A$5&ROW($A1039)),'State Lookup'!$A:$B,2,FALSE),\"\")","v":""}]
[null,"",{"$f":"IFERROR(VLOOKUP(INDIRECT($A$5&ROW($A1040)),'State Lookup'!$A:$B,2,FALSE),\"\")","v":""}]
[null,"",{"$f":"IFERROR(VLOOKUP(INDIRECT($A$5&ROW($A1041)),'State Lookup'!$A:$B,2,FALSE),\"\")","v":""}]
[null,"",{"$f":"IFERROR(VLOOKUP(INDIRECT($A$5&ROW($A1042)),'State Lookup'!$A:$B,2,FALSE),\"\")","v":""}]
[null,"",{"$f":"IFERROR(VLOOKUP(INDIRECT($A$5&ROW($A1043)),'State Lookup'!$A:$B,2,FALSE),\"\")","v":""}]
[null,"",{"$f":"IFERROR(VLOOKUP(INDIRECT($A$5&ROW($A1044)),'State Lookup'!$A:$B,2,FALSE),\"\")","v":""}]
[null,"",{"$f":"IFERROR(VLOOKUP(INDIRECT($A$5&ROW($A1045)),'State Lookup'!$A:$B,2,FALSE),\"\")","v":""}]
[null,"",{"$f":"IFERROR(VLOOKUP(INDIRECT($A$5&ROW($A1046)),'State Lookup'!$A:$B,2,FALSE),\"\")","v":""}]
[null,"",{"$f":"IFERROR(VLOOKUP(INDIRECT($A$5&ROW($A1047)),'State Lookup'!$A:$B,2,FALSE),\"\")","v":""}]
[null,"",{"$f":"IFERROR(VLOOKUP(INDIRECT($A$5&ROW($A1048)),'State Lookup'!$A:$B,2,FALSE),\"\")","v":""}]
[null,"",{"$f":"IFERROR(VLOOKUP(INDIRECT($A$5&ROW($A1049)),'State Lookup'!$A:$B,2,FALSE),\"\")","v":""}]
[null,"",{"$f":"IFERROR(VLOOKUP(INDIRECT($A$5&ROW($A1050)),'State Lookup'!$A:$B,2,FALSE),\"\")","v":""}]
[null,"",{"$f":"IFERROR(VLOOKUP(INDIRECT($A$5&ROW($A1051)),'State Lookup'!$A:$B,2,FALSE),\"\")","v":""}]
[null,"",{"$f":"IFERROR(VLOOKUP(INDIRECT($A$5&ROW($A1052)),'State Lookup'!$A:$B,2,FALSE),\"\")","v":""}]
[null,"",{"$f":"IFERROR(VLOOKUP(INDIRECT($A$5&ROW($A1053)),'State Lookup'!$A:$B,2,FALSE),\"\")","v":""}]
[null,"",{"$f":"IFERROR(VLOOKUP(INDIRECT($A$5&ROW($A1054)),'State Lookup'!$A:$B,2,FALSE),\"\")","v":""}]
[null,"",{"$f":"IFERROR(VLOOKUP(INDIRECT($A$5&ROW($A1055)),'State Lookup'!$A:$B,2,FALSE),\"\")","v":""}]
[null,"",{"$f":"IFERROR(VLOOKUP(INDIRECT($A$5&ROW($A1056)),'State Lookup'!$A:$B,2,FALSE),\"\")","v":""}]
[null,"",{"$f":"IFERROR(VLOOKUP(INDIRECT($A$5&ROW($A1057)),'State Lookup'!$A:$B,2,FALSE),\"\")","v":""}]
[null,"",{"$f":"IFERROR(VLOOKUP(INDIRECT($A$5&ROW($A1058)),'State Lookup'!$A:$B,2,FALSE),\"\")","v":""}]
[null,"",{"$f":"IFERROR(VLOOKUP(INDIRECT($A$5&ROW($A1059)),'State Lookup'!$A:$B,2,FALSE),\"\")","v":""}]
[null,"",{"$f":"IFERROR(VLOOKUP(INDIRECT($A$5&ROW($A1060)),'State Lookup'!$A:$B,2,FALSE),\"\")","v":""}]
[null,"",{"$f":"IFERROR(VLOOKUP(INDIRECT($A$5&ROW($A1061)),'State Lookup'!$A:$B,2,FALSE),\"\")","v":""}]
[null,"",{"$f":"IFERROR(VLOOKUP(INDIRECT($A$5&ROW($A1062)),'State Lookup'!$A:$B,2,FALSE),\"\")","v":""}]
[null,"",{"$f":"IFERROR(VLOOKUP(INDIRECT($A$5&ROW($A1063)),'State Lookup'!$A:$B,2,FALSE),\"\")","v":""}]
[null,"",{"$f":"IFERROR(VLOOKUP(INDIRECT($A$5&ROW($A1064)),'State Lookup'!$A:$B,2,FALSE),\"\")","v":""}]
[null,"",{"$f":"IFERROR(VLOOKUP(INDIRECT($A$5&ROW($A1065)),'State Lookup'!$A:$B,2,FALSE),\"\")","v":""}]
[null,"",{"$f":"IFERROR(VLOOKUP(INDIRECT($A$5&ROW($A1066)),'State Lookup'!$A:$B,2,FALSE),\"\")","v":""}]
[null,"",{"$f":"IFERROR(VLOOKUP(INDIRECT($A$5&ROW($A1067)),'State Lookup'!$A:$B,2,FALSE),\"\")","v":""}]
[null,"",{"$f":"IFERROR(VLOOKUP(INDIRECT($A$5&ROW($A1068)),'State Lookup'!$A:$B,2,FALSE),\"\")","v":""}]
[null,"",{"$f":"IFERROR(VLOOKUP(INDIRECT($A$5&ROW($A1069)),'State Lookup'!$A:$B,2,FALSE),\"\")","v":""}]
[null,"",{"$f":"IFERROR(VLOOKUP(INDIRECT($A$5&ROW($A1070)),'State Lookup'!$A:$B,2,FALSE),\"\")","v":""}]
[null,"",{"$f":"IFERROR(VLOOKUP(INDIRECT($A$5&ROW($A1071)),'State Lookup'!$A:$B,2,FALSE),\"\")","v":""}]
[null,"",{"$f":"IFERROR(VLOOKUP(INDIRECT($A$5&ROW($A1072)),'State Lookup'!$A:$B,2,FALSE),\"\")","v":""}]
[null,"",{"$f":"IFERROR(VLOOKUP(INDIRECT($A$5&ROW($A1073)),'State Lookup'!$A:$B,2,FALSE),\"\")","v":""}]
[null,"",{"$f":"IFERROR(VLOOKUP(INDIRECT($A$5&ROW($A1074)),'State Lookup'!$A:$B,2,FALSE),\"\")","v":""}]
[null,"",{"$f":"IFERROR(VLOOKUP(INDIRECT($A$5&ROW($A1075)),'State Lookup'!$A:$B,2,FALSE),\"\")","v":""}]
[null,"",{"$f":"IFERROR(VLOOKUP(INDIRECT($A$5&ROW($A1076)),'State Lookup'!$A:$B,2,FALSE),\"\")","v":""}]
[null,"",{"$f":"IFERROR(VLOOKUP(INDIRECT($A$5&ROW($A1077)),'State Lookup'!$A:$B,2,FALSE),\"\")","v":""}]
[null,"",{"$f":"IFERROR(VLOOKUP(INDIRECT($A$5&ROW($A1078)),'State Lookup'!$A:$B,2,FALSE),\"\")","v":""}]
[null,"",{"$f":"IFERROR(VLOOKUP(INDIRECT($A$5&ROW($A1079)),'State Lookup'!$A:$B,2,FALSE),\"\")","v":""}]
[null,"",{"$f":"IFERROR(VLOOKUP(INDIRECT($A$5&ROW($A1080)),'State Lookup'!$A:$B,2,FALSE),\"\")","v":""}]
[null,"",{"$f":"IFERROR(VLOOKUP(INDIRECT($A$5&ROW($A1081)),'State Lookup'!$A:$B,2,FALSE),\"\")","v":""}]
[null,"",{"$f":"IFERROR(VLOOKUP(INDIRECT($A$5&ROW($A1082)),'State Lookup'!$A:$B,2,FALSE),\"\")","v":""}]
[null,"",{"$f":"IFERROR(VLOOKUP(INDIRECT($A$5&ROW($A1083)),'State Lookup'!$A:$B,2,FALSE),\"\")","v":""}]
[null,"",{"$f":"IFERROR(VLOOKUP(INDIRECT($A$5&ROW($A1084)),'State Lookup'!$A:$B,2,FALSE),\"\")","v":""}]
[null,"",{"$f":"IFERROR(VLOOKUP(INDIRECT($A$5&ROW($A1085)),'State Lookup'!$A:$B,2,FALSE),\"\")","v":""}]
[null,"",{"$f":"IFERROR(VLOOKUP(INDIRECT($A$5&ROW($A1086)),'State Lookup'!$A:$B,2,FALSE),\"\")","v":""}]
[null,"",{"$f":"IFERROR(VLOOKUP(INDIRECT($A$5&ROW($A1087)),'State Lookup'!$A:$B,2,FALSE),\"\")","v":""}]
[null,"",{"$f":"IFERROR(VLOOKUP(INDIRECT($A$5&ROW($A1088)),'State Lookup'!$A:$B,2,FALSE),\"\")","v":""}]
[null,"",{"$f":"IFERROR(VLOOKUP(INDIRECT($A$5&ROW($A1089)),'State Lookup'!$A:$B,2,FALSE),\"\")","v":""}]
[null,"",{"$f":"IFERROR(VLOOKUP(INDIRECT($A$5&ROW($A1090)),'State Lookup'!$A:$B,2,FALSE),\"\")","v":""}]
[null,{"$f":"IFERROR((INDIRECT($A$3&ROW($A1091))/INDIRECT($A$1&ROW($A1091)))*100,\"\")","v":""},{"$f":"IFERROR(VLOOKUP(INDIRECT($A$5&ROW($A1091)),'State Lookup'!$A:$B,2,FALSE),\"\")","v":""}]
[null,"",{"$f":"IFERROR(VLOOKUP(INDIRECT($A$5&ROW($A1092)),'State Lookup'!$A:$B,2,FALSE),\"\")","v":""}]
[null,"",{"$f":"IFERROR(VLOOKUP(INDIRECT($A$5&ROW($A1093)),'State Lookup'!$A:$B,2,FALSE),\"\")","v":""}]
[null,"",{"$f":"IFERROR(VLOOKUP(INDIRECT($A$5&ROW($A1094)),'State Lookup'!$A:$B,2,FALSE),\"\")","v":""}]
[null,"",{"$f":"IFERROR(VLOOKUP(INDIRECT($A$5&ROW($A1095)),'State Lookup'!$A:$B,2,FALSE),\"\")","v":""}]
[null,"",{"$f":"IFERROR(VLOOKUP(INDIRECT($A$5&ROW($A1096)),'State Lookup'!$A:$B,2,FALSE),\"\")","v":""}]
[null,"",{"$f":"IFERROR(VLOOKUP(INDIRECT($A$5&ROW($A1097)),'State Lookup'!$A:$B,2,FALSE),\"\")","v":""}]
[null,"",{"$f":"IFERROR(VLOOKUP(INDIRECT($A$5&ROW($A1098)),'State Lookup'!$A:$B,2,FALSE),\"\")","v":""}]
[null,"",{"$f":"IFERROR(VLOOKUP(INDIRECT($A$5&ROW($A1099)),'State Lookup'!$A:$B,2,FALSE),\"\")","v":""}]
[null,"",{"$f":"IFERROR(VLOOKUP(INDIRECT($A$5&ROW($A1100)),'State Lookup'!$A:$B,2,FALSE),\"\")","v":""}]
[null,"",{"$f":"IFERROR(VLOOKUP(INDIRECT($A$5&ROW($A1101)),'State Lookup'!$A:$B,2,FALSE),\"\")","v":""}]
[null,"",{"$f":"IFERROR(VLOOKUP(INDIRECT($A$5&ROW($A1102)),'State Lookup'!$A:$B,2,FALSE),\"\")","v":""}]
[null,"",{"$f":"IFERROR(VLOOKUP(INDIRECT($A$5&ROW($A1103)),'State Lookup'!$A:$B,2,FALSE),\"\")","v":""}]
[null,"",{"$f":"IFERROR(VLOOKUP(INDIRECT($A$5&ROW($A1104)),'State Lookup'!$A:$B,2,FALSE),\"\")","v":""}]
[null,"",{"$f":"IFERROR(VLOOKUP(INDIRECT($A$5&ROW($A1105)),'State Lookup'!$A:$B,2,FALSE),\"\")","v":""}]
[null,"",{"$f":"IFERROR(VLOOKUP(INDIRECT($A$5&ROW($A1106)),'State Lookup'!$A:$B,2,FALSE),\"\")","v":""}]
[null,"",{"$f":"IFERROR(VLOOKUP(INDIRECT($A$5&ROW($A1107)),'State Lookup'!$A:$B,2,FALSE),\"\")","v":""}]
[null,"",{"$f":"IFERROR(VLOOKUP(INDIRECT($A$5&ROW($A1108)),'State Lookup'!$A:$B,2,FALSE),\"\")","v":""}]
[null,"",{"$f":"IFERROR(VLOOKUP(INDIRECT($A$5&ROW($A1109)),'State Lookup'!$A:$B,2,FALSE),\"\")","v":""}]
[null,"",{"$f":"IFERROR(VLOOKUP(INDIRECT($A$5&ROW($A1110)),'State Lookup'!$A:$B,2,FALSE),\"\")","v":""}]
[null,"",{"$f":"IFERROR(VLOOKUP(INDIRECT($A$5&ROW($A1111)),'State Lookup'!$A:$B,2,FALSE),\"\")","v":""}]
[null,"",{"$f":"IFERROR(VLOOKUP(INDIRECT($A$5&ROW($A1112)),'State Lookup'!$A:$B,2,FALSE),\"\")","v":""}]
[null,"",{"$f":"IFERROR(VLOOKUP(INDIRECT($A$5&ROW($A1113)),'State Lookup'!$A:$B,2,FALSE),\"\")","v":""}]
[null,"",{"$f":"IFERROR(VLOOKUP(INDIRECT($A$5&ROW($A1114)),'State Lookup'!$A:$B,2,FALSE),\"\")","v":""}]
[null,"",{"$f":"IFERROR(VLOOKUP(INDIRECT($A$5&ROW($A1115)),'State Lookup'!$A:$B,2,FALSE),\"\")","v":""}]
[null,"",{"$f":"IFERROR(VLOOKUP(INDIRECT($A$5&ROW($A1116)),'State Lookup'!$A:$B,2,FALSE),\"\")","v":""}]
[null,"",{"$f":"IFERROR(VLOOKUP(INDIRECT($A$5&ROW($A1117)),'State Lookup'!$A:$B,2,FALSE),\"\")","v":""}]
[null,"",{"$f":"IFERROR(VLOOKUP(INDIRECT($A$5&ROW($A1118)),'State Lookup'!$A:$B,2,FALSE),\"\")","v":""}]
[null,"",{"$f":"IFERROR(VLOOKUP(INDIRECT($A$5&ROW($A1119)),'State Lookup'!$A:$B,2,FALSE),\"\")","v":""}]
[null,"",{"$f":"IFERROR(VLOOKUP(INDIRECT($A$5&ROW($A1120)),'State Lookup'!$A:$B,2,FALSE),\"\")","v":""}]
[null,"",{"$f":"IFERROR(VLOOKUP(INDIRECT($A$5&ROW($A1121)),'State Lookup'!$A:$B,2,FALSE),\"\")","v":""}]
[null,"",{"$f":"IFERROR(VLOOKUP(INDIRECT($A$5&ROW($A1122)),'State Lookup'!$A:$B,2,FALSE),\"\")","v":""}]
[null,"",{"$f":"IFERROR(VLOOKUP(INDIRECT($A$5&ROW($A1123)),'State Lookup'!$A:$B,2,FALSE),\"\")","v":""}]
[null,"",{"$f":"IFERROR(VLOOKUP(INDIRECT($A$5&ROW($A1124)),'State Lookup'!$A:$B,2,FALSE),\"\")","v":""}]
[null,"",{"$f":"IFERROR(VLOOKUP(INDIRECT($A$5&ROW($A1125)),'State Lookup'!$A:$B,2,FALSE),\"\")","v":""}]
[null,"",{"$f":"IFERROR(VLOOKUP(INDIRECT($A$5&ROW($A1126)),'State Lookup'!$A:$B,2,FALSE),\"\")","v":""}]
[null,"",{"$f":"IFERROR(VLOOKUP(INDIRECT($A$5&ROW($A1127)),'State Lookup'!$A:$B,2,FALSE),\"\")","v":""}]
[null,"",{"$f":"IFERROR(VLOOKUP(INDIRECT($A$5&ROW($A1128)),'State Lookup'!$A:$B,2,FALSE),\"\")","v":""}]
[null,"",{"$f":"IFERROR(VLOOKUP(INDIRECT($A$5&ROW($A1129)),'State Lookup'!$A:$B,2,FALSE),\"\")","v":""}]
[null,"",{"$f":"IFERROR(VLOOKUP(INDIRECT($A$5&ROW($A1130)),'State Lookup'!$A:$B,2,FALSE),\"\")","v":""}]
[null,"",{"$f":"IFERROR(VLOOKUP(INDIRECT($A$5&ROW($A1131)),'State Lookup'!$A:$B,2,FALSE),\"\")","v":""}]
[null,"",{"$f":"IFERROR(VLOOKUP(INDIRECT($A$5&ROW($A1132)),'State Lookup'!$A:$B,2,FALSE),\"\")","v":""}]
[null,"",{"$f":"IFERROR(VLOOKUP(INDIRECT($A$5&ROW($A1133)),'State Lookup'!$A:$B,2,FALSE),\"\")","v":""}]
[null,"",{"$f":"IFERROR(VLOOKUP(INDIRECT($A$5&ROW($A1134)),'State Lookup'!$A:$B,2,FALSE),\"\")","v":""}]
[null,"",{"$f":"IFERROR(VLOOKUP(INDIRECT($A$5&ROW($A1135)),'State Lookup'!$A:$B,2,FALSE),\"\")","v":""}]
[null,"",{"$f":"IFERROR(VLOOKUP(INDIRECT($A$5&ROW($A1136)),'State Lookup'!$A:$B,2,FALSE),\"\")","v":""}]
[null,"",{"$f":"IFERROR(VLOOKUP(INDIRECT($A$5&ROW($A1137)),'State Lookup'!$A:$B,2,FALSE),\"\")","v":""}]
[null,"",{"$f":"IFERROR(VLOOKUP(INDIRECT($A$5&ROW($A1138)),'State Lookup'!$A:$B,2,FALSE),\"\")","v":""}]
[null,"",{"$f":"IFERROR(VLOOKUP(INDIRECT($A$5&ROW($A1139)),'State Lookup'!$A:$B,2,FALSE),\"\")","v":""}]
[null,"",{"$f":"IFERROR(VLOOKUP(INDIRECT($A$5&ROW($A1140)),'State Lookup'!$A:$B,2,FALSE),\"\")","v":""}]
[null,"",{"$f":"IFERROR(VLOOKUP(INDIRECT($A$5&ROW($A1141)),'State Lookup'!$A:$B,2,FALSE),\"\")","v":""}]
[null,"",{"$f":"IFERROR(VLOOKUP(INDIRECT($A$5&ROW($A1142)),'State Lookup'!$A:$B,2,FALSE),\"\")","v":""}]
[null,"",{"$f":"IFERROR(VLOOKUP(INDIRECT($A$5&ROW($A1143)),'State Lookup'!$A:$B,2,FALSE),\"\")","v":""}]
[null,"",{"$f":"IFERROR(VLOOKUP(INDIRECT($A$5&ROW($A1144)),'State Lookup'!$A:$B,2,FALSE),\"\")","v":""}]
[null,"",{"$f":"IFERROR(VLOOKUP(INDIRECT($A$5&ROW($A1145)),'State Lookup'!$A:$B,2,FALSE),\"\")","v":""}]
[null,"",{"$f":"IFERROR(VLOOKUP(INDIRECT($A$5&ROW($A1146)),'State Lookup'!$A:$B,2,FALSE),\"\")","v":""}]
[null,"",{"$f":"IFERROR(VLOOKUP(INDIRECT($A$5&ROW($A1147)),'State Lookup'!$A:$B,2,FALSE),\"\")","v":""}]
[null,"",{"$f":"IFERROR(VLOOKUP(INDIRECT($A$5&ROW($A1148)),'State Lookup'!$A:$B,2,FALSE),\"\")","v":""}]
[null,"",{"$f":"IFERROR(VLOOKUP(INDIRECT($A$5&ROW($A1149)),'State Lookup'!$A:$B,2,FALSE),\"\")","v":""}]
[null,"",{"$f":"IFERROR(VLOOKUP(INDIRECT($A$5&ROW($A1150)),'State Lookup'!$A:$B,2,FALSE),\"\")","v":""}]
[null,"",{"$f":"IFERROR(VLOOKUP(INDIRECT($A$5&ROW($A1151)),'State Lookup'!$A:$B,2,FALSE),\"\")","v":""}]
[null,"",{"$f":"IFERROR(VLOOKUP(INDIRECT($A$5&ROW($A1152)),'State Lookup'!$A:$B,2,FALSE),\"\")","v":""}]
[null,"",{"$f":"IFERROR(VLOOKUP(INDIRECT($A$5&ROW($A1153)),'State Lookup'!$A:$B,2,FALSE),\"\")","v":""}]
[null,"",{"$f":"IFERROR(VLOOKUP(INDIRECT($A$5&ROW($A1154)),'State Lookup'!$A:$B,2,FALSE),\"\")","v":""}]
[null,{"$f":"IFERROR((INDIRECT($A$3&ROW($A1155))/INDIRECT($A$1&ROW($A1155)))*100,\"\")","v":""},{"$f":"IFERROR(VLOOKUP(INDIRECT($A$5&ROW($A1155)),'State Lookup'!$A:$B,2,FALSE),\"\")","v":""}]
[null,"",{"$f":"IFERROR(VLOOKUP(INDIRECT($A$5&ROW($A1156)),'State Lookup'!$A:$B,2,FALSE),\"\")","v":""}]
[null,"",{"$f":"IFERROR(VLOOKUP(INDIRECT($A$5&ROW($A1157)),'State Lookup'!$A:$B,2,FALSE),\"\")","v":""}]
[null,"",{"$f":"IFERROR(VLOOKUP(INDIRECT($A$5&ROW($A1158)),'State Lookup'!$A:$B,2,FALSE),\"\")","v":""}]
[null,"",{"$f":"IFERROR(VLOOKUP(INDIRECT($A$5&ROW($A1159)),'State Lookup'!$A:$B,2,FALSE),\"\")","v":""}]
[null,"",{"$f":"IFERROR(VLOOKUP(INDIRECT($A$5&ROW($A1160)),'State Lookup'!$A:$B,2,FALSE),\"\")","v":""}]
[null,"",{"$f":"IFERROR(VLOOKUP(INDIRECT($A$5&ROW($A1161)),'State Lookup'!$A:$B,2,FALSE),\"\")","v":""}]
[null,"",{"$f":"IFERROR(VLOOKUP(INDIRECT($A$5&ROW($A1162)),'State Lookup'!$A:$B,2,FALSE),\"\")","v":""}]
[null,"",{"$f":"IFERROR(VLOOKUP(INDIRECT($A$5&ROW($A1163)),'State Lookup'!$A:$B,2,FALSE),\"\")","v":""}]
[null,"",{"$f":"IFERROR(VLOOKUP(INDIRECT($A$5&ROW($A1164)),'State Lookup'!$A:$B,2,FALSE),\"\")","v":""}]
[null,"",{"$f":"IFERROR(VLOOKUP(INDIRECT($A$5&ROW($A1165)),'State Lookup'!$A:$B,2,FALSE),\"\")","v":""}]
[null,"",{"$f":"IFERROR(VLOOKUP(INDIRECT($A$5&ROW($A1166)),'State Lookup'!$A:$B,2,FALSE),\"\")","v":""}]
[null,"",{"$f":"IFERROR(VLOOKUP(INDIRECT($A$5&ROW($A1167)),'State Lookup'!$A:$B,2,FALSE),\"\")","v":""}]
[null,"",{"$f":"IFERROR(VLOOKUP(INDIRECT($A$5&ROW($A1168)),'State Lookup'!$A:$B,2,FALSE),\"\")","v":""}]
[null,"",{"$f":"IFERROR(VLOOKUP(INDIRECT($A$5&ROW($A1169)),'State Lookup'!$A:$B,2,FALSE),\"\")","v":""}]
[null,"",{"$f":"IFERROR(VLOOKUP(INDIRECT($A$5&ROW($A1170)),'State Lookup'!$A:$B,2,FALSE),\"\")","v":""}]
[null,"",{"$f":"IFERROR(VLOOKUP(INDIRECT($A$5&ROW($A1171)),'State Lookup'!$A:$B,2,FALSE),\"\")","v":""}]
[null,"",{"$f":"IFERROR(VLOOKUP(INDIRECT($A$5&ROW($A1172)),'State Lookup'!$A:$B,2,FALSE),\"\")","v":""}]
[null,"",{"$f":"IFERROR(VLOOKUP(INDIRECT($A$5&ROW($A1173)),'State Lookup'!$A:$B,2,FALSE),\"\")","v":""}]
[null,"",{"$f":"IFERROR(VLOOKUP(INDIRECT($A$5&ROW($A1174)),'State Lookup'!$A:$B,2,FALSE),\"\")","v":""}]
[null,"",{"$f":"IFERROR(VLOOKUP(INDIRECT($A$5&ROW($A1175)),'State Lookup'!$A:$B,2,FALSE),\"\")","v":""}]
[null,"",{"$f":"IFERROR(VLOOKUP(INDIRECT($A$5&ROW($A1176)),'State Lookup'!$A:$B,2,FALSE),\"\")","v":""}]
[null,"",{"$f":"IFERROR(VLOOKUP(INDIRECT($A$5&ROW($A1177)),'State Lookup'!$A:$B,2,FALSE),\"\")","v":""}]
[null,"",{"$f":"IFERROR(VLOOKUP(INDIRECT($A$5&ROW($A1178)),'State Lookup'!$A:$B,2,FALSE),\"\")","v":""}]
[null,"",{"$f":"IFERROR(VLOOKUP(INDIRECT($A$5&ROW($A1179)),'State Lookup'!$A:$B,2,FALSE),\"\")","v":""}]
[null,"",{"$f":"IFERROR(VLOOKUP(INDIRECT($A$5&ROW($A1180)),'State Lookup'!$A:$B,2,FALSE),\"\")","v":""}]
[null,"",{"$f":"IFERROR(VLOOKUP(INDIRECT($A$5&ROW($A1181)),'State Lookup'!$A:$B,2,FALSE),\"\")","v":""}]
[null,"",{"$f":"IFERROR(VLOOKUP(INDIRECT($A$5&ROW($A1182)),'State Lookup'!$A:$B,2,FALSE),\"\")","v":""}]
[null,"",{"$f":"IFERROR(VLOOKUP(INDIRECT($A$5&ROW($A1183)),'State Lookup'!$A:$B,2,FALSE),\"\")","v":""}]
[null,"",{"$f":"IFERROR(VLOOKUP(INDIRECT($A$5&ROW($A1184)),'State Lookup'!$A:$B,2,FALSE),\"\")","v":""}]
[null,"",{"$f":"IFERROR(VLOOKUP(INDIRECT($A$5&ROW($A1185)),'State Lookup'!$A:$B,2,FALSE),\"\")","v":""}]
[null,"",{"$f":"IFERROR(VLOOKUP(INDIRECT($A$5&ROW($A1186)),'State Lookup'!$A:$B,2,FALSE),\"\")","v":""}]
[null,"",{"$f":"IFERROR(VLOOKUP(INDIRECT($A$5&ROW($A1187)),'State Lookup'!$A:$B,2,FALSE),\"\")","v":""}]
[null,"",{"$f":"IFERROR(VLOOKUP(INDIRECT($A$5&ROW($A1188)),'State Lookup'!$A:$B,2,FALSE),\"\")","v":""}]
[null,"",{"$f":"IFERROR(VLOOKUP(INDIRECT($A$5&ROW($A1189)),'State Lookup'!$A:$B,2,FALSE),\"\")","v":""}]
[null,"",{"$f":"IFERROR(VLOOKUP(INDIRECT($A$5&ROW($A1190)),'State Lookup'!$A:$B,2,FALSE),\"\")","v":""}]
[null,"",{"$f":"IFERROR(VLOOKUP(INDIRECT($A$5&ROW($A1191)),'State Lookup'!$A:$B,2,FALSE),\"\")","v":""}]
[null,"",{"$f":"IFERROR(VLOOKUP(INDIRECT($A$5&ROW($A1192)),'State Lookup'!$A:$B,2,FALSE),\"\")","v":""}]
[null,"",{"$f":"IFERROR(VLOOKUP(INDIRECT($A$5&ROW($A1193)),'State Lookup'!$A:$B,2,FALSE),\"\")","v":""}]
[null,"",{"$f":"IFERROR(VLOOKUP(INDIRECT($A$5&ROW($A1194)),'State Lookup'!$A:$B,2,FALSE),\"\")","v":""}]
[null,"",{"$f":"IFERROR(VLOOKUP(INDIRECT($A$5&ROW($A1195)),'State Lookup'!$A:$B,2,FALSE),\"\")","v":""}]
[null,"",{"$f":"IFERROR(VLOOKUP(INDIRECT($A$5&ROW($A1196)),'State Lookup'!$A:$B,2,FALSE),\"\")","v":""}]
[null,"",{"$f":"IFERROR(VLOOKUP(INDIRECT($A$5&ROW($A1197)),'State Lookup'!$A:$B,2,FALSE),\"\")","v":""}]
[null,"",{"$f":"IFERROR(VLOOKUP(INDIRECT($A$5&ROW($A1198)),'State Lookup'!$A:$B,2,FALSE),\"\")","v":""}]
[null,"",{"$f":"IFERROR(VLOOKUP(INDIRECT($A$5&ROW($A1199)),'State Lookup'!$A:$B,2,FALSE),\"\")","v":""}]
[null,"",{"$f":"IFERROR(VLOOKUP(INDIRECT($A$5&ROW($A1200)),'State Lookup'!$A:$B,2,FALSE),\"\")","v":""}]
[null,"",{"$f":"IFERROR(VLOOKUP(INDIRECT($A$5&ROW($A1201)),'State Lookup'!$A:$B,2,FALSE),\"\")","v":""}]
[null,"",{"$f":"IFERROR(VLOOKUP(INDIRECT($A$5&ROW($A1202)),'State Lookup'!$A:$B,2,FALSE),\"\")","v":""}]
[null,"",{"$f":"IFERROR(VLOOKUP(INDIRECT($A$5&ROW($A1203)),'State Lookup'!$A:$B,2,FALSE),\"\")","v":""}]
[null,"",{"$f":"IFERROR(VLOOKUP(INDIRECT($A$5&ROW($A1204)),'State Lookup'!$A:$B,2,FALSE),\"\")","v":""}]
[null,"",{"$f":"IFERROR(VLOOKUP(INDIRECT($A$5&ROW($A1205)),'State Lookup'!$A:$B,2,FALSE),\"\")","v":""}]
[null,"",{"$f":"IFERROR(VLOOKUP(INDIRECT($A$5&ROW($A1206)),'State Lookup'!$A:$B,2,FALSE),\"\")","v":""}]
[null,"",{"$f":"IFERROR(VLOOKUP(INDIRECT($A$5&ROW($A1207)),'State Lookup'!$A:$B,2,FALSE),\"\")","v":""}]
[null,"",{"$f":"IFERROR(VLOOKUP(INDIRECT($A$5&ROW($A1208)),'State Lookup'!$A:$B,2,FALSE),\"\")","v":""}]
[null,"",{"$f":"IFERROR(VLOOKUP(INDIRECT($A$5&ROW($A1209)),'State Lookup'!$A:$B,2,FALSE),\"\")","v":""}]
[null,"",{"$f":"IFERROR(VLOOKUP(INDIRECT($A$5&ROW($A1210)),'State Lookup'!$A:$B,2,FALSE),\"\")","v":""}]
[null,"",{"$f":"IFERROR(VLOOKUP(INDIRECT($A$5&ROW($A1211)),'State Lookup'!$A:$B,2,FALSE),\"\")","v":""}]
[null,"",{"$f":"IFERROR(VLOOKUP(INDIRECT($A$5&ROW($A1212)),'State Lookup'!$A:$B,2,FALSE),\"\")","v":""}]
[null,"",{"$f":"IFERROR(VLOOKUP(INDIRECT($A$5&ROW($A1213)),'State Lookup'!$A:$B,2,FALSE),\"\")","v":""}]
[null,"",{"$f":"IFERROR(VLOOKUP(INDIRECT($A$5&ROW($A1214)),'State Lookup'!$A:$B,2,FALSE),\"\")","v":""}]
[null,"",{"$f":"IFERROR(VLOOKUP(INDIRECT($A$5&ROW($A1215)),'State Lookup'!$A:$B,2,FALSE),\"\")","v":""}]
[null,"",{"$f":"IFERROR(VLOOKUP(INDIRECT($A$5&ROW($A1216)),'State Lookup'!$A:$B,2,FALSE),\"\")","v":""}]
[null,"",{"$f":"IFERROR(VLOOKUP(INDIRECT($A$5&ROW($A1217)),'State Lookup'!$A:$B,2,FALSE),\"\")","v":""}]
[null,"",{"$f":"IFERROR(VLOOKUP(INDIRECT($A$5&ROW($A1218)),'State Lookup'!$A:$B,2,FALSE),\"\")","v":""}]
[null,{"$f":"IFERROR((INDIRECT($A$3&ROW($A1219))/INDIRECT($A$1&ROW($A1219)))*100,\"\")","v":""},{"$f":"IFERROR(VLOOKUP(INDIRECT($A$5&ROW($A1219)),'State Lookup'!$A:$B,2,FALSE),\"\")","v":""}]
[null,"",{"$f":"IFERROR(VLOOKUP(INDIRECT($A$5&ROW($A1220)),'State Lookup'!$A:$B,2,FALSE),\"\")","v":""}]
[null,"",{"$f":"IFERROR(VLOOKUP(INDIRECT($A$5&ROW($A1221)),'State Lookup'!$A:$B,2,FALSE),\"\")","v":""}]
[null,"",{"$f":"IFERROR(VLOOKUP(INDIRECT($A$5&ROW($A1222)),'State Lookup'!$A:$B,2,FALSE),\"\")","v":""}]
[null,"",{"$f":"IFERROR(VLOOKUP(INDIRECT($A$5&ROW($A1223)),'State Lookup'!$A:$B,2,FALSE),\"\")","v":""}]
[null,"",{"$f":"IFERROR(VLOOKUP(INDIRECT($A$5&ROW($A1224)),'State Lookup'!$A:$B,2,FALSE),\"\")","v":""}]
[null,"",{"$f":"IFERROR(VLOOKUP(INDIRECT($A$5&ROW($A1225)),'State Lookup'!$A:$B,2,FALSE),\"\")","v":""}]
[null,"",{"$f":"IFERROR(VLOOKUP(INDIRECT($A$5&ROW($A1226)),'State Lookup'!$A:$B,2,FALSE),\"\")","v":""}]
[null,"",{"$f":"IFERROR(VLOOKUP(INDIRECT($A$5&ROW($A1227)),'State Lookup'!$A:$B,2,FALSE),\"\")","v":""}]
[null,"",{"$f":"IFERROR(VLOOKUP(INDIRECT($A$5&ROW($A1228)),'State Lookup'!$A:$B,2,FALSE),\"\")","v":""}]
[null,"",{"$f":"IFERROR(VLOOKUP(INDIRECT($A$5&ROW($A1229)),'State Lookup'!$A:$B,2,FALSE),\"\")","v":""}]
[null,"",{"$f":"IFERROR(VLOOKUP(INDIRECT($A$5&ROW($A1230)),'State Lookup'!$A:$B,2,FALSE),\"\")","v":""}]
[null,"",{"$f":"IFERROR(VLOOKUP(INDIRECT($A$5&ROW($A1231)),'State Lookup'!$A:$B,2,FALSE),\"\")","v":""}]
[null,"",{"$f":"IFERROR(VLOOKUP(INDIRECT($A$5&ROW($A1232)),'State Lookup'!$A:$B,2,FALSE),\"\")","v":""}]
[null,"",{"$f":"IFERROR(VLOOKUP(INDIRECT($A$5&ROW($A1233)),'State Lookup'!$A:$B,2,FALSE),\"\")","v":""}]
[null,"",{"$f":"IFERROR(VLOOKUP(INDIRECT($A$5&ROW($A1234)),'State Lookup'!$A:$B,2,FALSE),\"\")","v":""}]
[null,"",{"$f":"IFERROR(VLOOKUP(INDIRECT($A$5&ROW($A1235)),'State Lookup'!$A:$B,2,FALSE),\"\")","v":""}]
[null,"",{"$f":"IFERROR(VLOOKUP(INDIRECT($A$5&ROW($A1236)),'State Lookup'!$A:$B,2,FALSE),\"\")","v":""}]
[null,"",{"$f":"IFERROR(VLOOKUP(INDIRECT($A$5&ROW($A1237)),'State Lookup'!$A:$B,2,FALSE),\"\")","v":""}]
[null,"",{"$f":"IFERROR(VLOOKUP(INDIRECT($A$5&ROW($A1238)),'State Lookup'!$A:$B,2,FALSE),\"\")","v":""}]
[null,"",{"$f":"IFERROR(VLOOKUP(INDIRECT($A$5&ROW($A1239)),'State Lookup'!$A:$B,2,FALSE),\"\")","v":""}]
[null,"",{"$f":"IFERROR(VLOOKUP(INDIRECT($A$5&ROW($A1240)),'State Lookup'!$A:$B,2,FALSE),\"\")","v":""}]
[null,"",{"$f":"IFERROR(VLOOKUP(INDIRECT($A$5&ROW($A1241)),'State Lookup'!$A:$B,2,FALSE),\"\")","v":""}]
[null,"",{"$f":"IFERROR(VLOOKUP(INDIRECT($A$5&ROW($A1242)),'State Lookup'!$A:$B,2,FALSE),\"\")","v":""}]
[null,"",{"$f":"IFERROR(VLOOKUP(INDIRECT($A$5&ROW($A1243)),'State Lookup'!$A:$B,2,FALSE),\"\")","v":""}]
[null,"",{"$f":"IFERROR(VLOOKUP(INDIRECT($A$5&ROW($A1244)),'State Lookup'!$A:$B,2,FALSE),\"\")","v":""}]
[null,"",{"$f":"IFERROR(VLOOKUP(INDIRECT($A$5&ROW($A1245)),'State Lookup'!$A:$B,2,FALSE),\"\")","v":""}]
[null,"",{"$f":"IFERROR(VLOOKUP(INDIRECT($A$5&ROW($A1246)),'State Lookup'!$A:$B,2,FALSE),\"\")","v":""}]
[null,"",{"$f":"IFERROR(VLOOKUP(INDIRECT($A$5&ROW($A1247)),'State Lookup'!$A:$B,2,FALSE),\"\")","v":""}]
[null,"",{"$f":"IFERROR(VLOOKUP(INDIRECT($A$5&ROW($A1248)),'State Lookup'!$A:$B,2,FALSE),\"\")","v":""}]
[null,"",{"$f":"IFERROR(VLOOKUP(INDIRECT($A$5&ROW($A1249)),'State Lookup'!$A:$B,2,FALSE),\"\")","v":""}]
[null,"",{"$f":"IFERROR(VLOOKUP(INDIRECT($A$5&ROW($A1250)),'State Lookup'!$A:$B,2,FALSE),\"\")","v":""}]
[null,"",{"$f":"IFERROR(VLOOKUP(INDIRECT($A$5&ROW($A1251)),'State Lookup'!$A:$B,2,FALSE),\"\")","v":""}]
[null,"",{"$f":"IFERROR(VLOOKUP(INDIRECT($A$5&ROW($A1252)),'State Lookup'!$A:$B,2,FALSE),\"\")","v":""}]
[null,"",{"$f":"IFERROR(VLOOKUP(INDIRECT($A$5&ROW($A1253)),'State Lookup'!$A:$B,2,FALSE),\"\")","v":""}]
[null,"",{"$f":"IFERROR(VLOOKUP(INDIRECT($A$5&ROW($A1254)),'State Lookup'!$A:$B,2,FALSE),\"\")","v":""}]
[null,"",{"$f":"IFERROR(VLOOKUP(INDIRECT($A$5&ROW($A1255)),'State Lookup'!$A:$B,2,FALSE),\"\")","v":""}]
[null,"",{"$f":"IFERROR(VLOOKUP(INDIRECT($A$5&ROW($A1256)),'State Lookup'!$A:$B,2,FALSE),\"\")","v":""}]
[null,"",{"$f":"IFERROR(VLOOKUP(INDIRECT($A$5&ROW($A1257)),'State Lookup'!$A:$B,2,FALSE),\"\")","v":""}]
[null,"",{"$f":"IFERROR(VLOOKUP(INDIRECT($A$5&ROW($A1258)),'State Lookup'!$A:$B,2,FALSE),\"\")","v":""}]
[null,"",{"$f":"IFERROR(VLOOKUP(INDIRECT($A$5&ROW($A1259)),'State Lookup'!$A:$B,2,FALSE),\"\")","v":""}]
[null,"",{"$f":"IFERROR(VLOOKUP(INDIRECT($A$5&ROW($A1260)),'State Lookup'!$A:$B,2,FALSE),\"\")","v":""}]
[null,"",{"$f":"IFERROR(VLOOKUP(INDIRECT($A$5&ROW($A1261)),'State Lookup'!$A:$B,2,FALSE),\"\")","v":""}]
[null,"",{"$f":"IFERROR(VLOOKUP(INDIRECT($A$5&ROW($A1262)),'State Lookup'!$A:$B,2,FALSE),\"\")","v":""}]
[null,"",{"$f":"IFERROR(VLOOKUP(INDIRECT($A$5&ROW($A1263)),'State Lookup'!$A:$B,2,FALSE),\"\")","v":""}]
[null,"",{"$f":"IFERROR(VLOOKUP(INDIRECT($A$5&ROW($A1264)),'State Lookup'!$A:$B,2,FALSE),\"\")","v":""}]
[null,"",{"$f":"IFERROR(VLOOKUP(INDIRECT($A$5&ROW($A1265)),'State Lookup'!$A:$B,2,FALSE),\"\")","v":""}]
[null,"",{"$f":"IFERROR(VLOOKUP(INDIRECT($A$5&ROW($A1266)),'State Lookup'!$A:$B,2,FALSE),\"\")","v":""}]
[null,"",{"$f":"IFERROR(VLOOKUP(INDIRECT($A$5&ROW($A1267)),'State Lookup'!$A:$B,2,FALSE),\"\")","v":""}]
[null,"",{"$f":"IFERROR(VLOOKUP(INDIRECT($A$5&ROW($A1268)),'State Lookup'!$A:$B,2,FALSE),\"\")","v":""}]
[null,"",{"$f":"IFERROR(VLOOKUP(INDIRECT($A$5&ROW($A1269)),'State Lookup'!$A:$B,2,FALSE),\"\")","v":""}]
[null,"",{"$f":"IFERROR(VLOOKUP(INDIRECT($A$5&ROW($A1270)),'State Lookup'!$A:$B,2,FALSE),\"\")","v":""}]
[null,"",{"$f":"IFERROR(VLOOKUP(INDIRECT($A$5&ROW($A1271)),'State Lookup'!$A:$B,2,FALSE),\"\")","v":""}]
[null,"",{"$f":"IFERROR(VLOOKUP(INDIRECT($A$5&ROW($A1272)),'State Lookup'!$A:$B,2,FALSE),\"\")","v":""}]
[null,"",{"$f":"IFERROR(VLOOKUP(INDIRECT($A$5&ROW($A1273)),'State Lookup'!$A:$B,2,FALSE),\"\")","v":""}]
[null,"",{"$f":"IFERROR(VLOOKUP(INDIRECT($A$5&ROW($A1274)),'State Lookup'!$A:$B,2,FALSE),\"\")","v":""}]
[null,"",{"$f":"IFERROR(VLOOKUP(INDIRECT($A$5&ROW($A1275)),'State Lookup'!$A:$B,2,FALSE),\"\")","v":""}]
[null,"",{"$f":"IFERROR(VLOOKUP(INDIRECT($A$5&ROW($A1276)),'State Lookup'!$A:$B,2,FALSE),\"\")","v":""}]
[null,"",{"$f":"IFERROR(VLOOKUP(INDIRECT($A$5&ROW($A1277)),'State Lookup'!$A:$B,2,FALSE),\"\")","v":""}]
[null,"",{"$f":"IFERROR(VLOOKUP(INDIRECT($A$5&ROW($A1278)),'State Lookup'!$A:$B,2,FALSE),\"\")","v":""}]
[null,"",{"$f":"IFERROR(VLOOKUP(INDIRECT($A$5&ROW($A1279)),'State Lookup'!$A:$B,2,FALSE),\"\")","v":""}]
[null,"",{"$f":"IFERROR(VLOOKUP(INDIRECT($A$5&ROW($A1280)),'State Lookup'!$A:$B,2,FALSE),\"\")","v":""}]
[null,"",{"$f":"IFERROR(VLOOKUP(INDIRECT($A$5&ROW($A1281)),'State Lookup'!$A:$B,2,FALSE),\"\")","v":""}]
[null,"",{"$f":"IFERROR(VLOOKUP(INDIRECT($A$5&ROW($A1282)),'State Lookup'!$A:$B,2,FALSE),\"\")","v":""}]
[null,{"$f":"IFERROR((INDIRECT($A$3&ROW($A1283))/INDIRECT($A$1&ROW($A1283)))*100,\"\")","v":""},{"$f":"IFERROR(VLOOKUP(INDIRECT($A$5&ROW($A1283)),'State Lookup'!$A:$B,2,FALSE),\"\")","v":""}]
[null,"",{"$f":"IFERROR(VLOOKUP(INDIRECT($A$5&ROW($A1284)),'State Lookup'!$A:$B,2,FALSE),\"\")","v":""}]
[null,"",{"$f":"IFERROR(VLOOKUP(INDIRECT($A$5&ROW($A1285)),'State Lookup'!$A:$B,2,FALSE),\"\")","v":""}]
[null,"",{"$f":"IFERROR(VLOOKUP(INDIRECT($A$5&ROW($A1286)),'State Lookup'!$A:$B,2,FALSE),\"\")","v":""}]
[null,"",{"$f":"IFERROR(VLOOKUP(INDIRECT($A$5&ROW($A1287)),'State Lookup'!$A:$B,2,FALSE),\"\")","v":""}]
[null,"",{"$f":"IFERROR(VLOOKUP(INDIRECT($A$5&ROW($A1288)),'State Lookup'!$A:$B,2,FALSE),\"\")","v":""}]
[null,"",{"$f":"IFERROR(VLOOKUP(INDIRECT($A$5&ROW($A1289)),'State Lookup'!$A:$B,2,FALSE),\"\")","v":""}]
[null,"",{"$f":"IFERROR(VLOOKUP(INDIRECT($A$5&ROW($A1290)),'State Lookup'!$A:$B,2,FALSE),\"\")","v":""}]
[null,"",{"$f":"IFERROR(VLOOKUP(INDIRECT($A$5&ROW($A1291)),'State Lookup'!$A:$B,2,FALSE),\"\")","v":""}]
[null,"",{"$f":"IFERROR(VLOOKUP(INDIRECT($A$5&ROW($A1292)),'State Lookup'!$A:$B,2,FALSE),\"\")","v":""}]
[null,"",{"$f":"IFERROR(VLOOKUP(INDIRECT($A$5&ROW($A1293)),'State Lookup'!$A:$B,2,FALSE),\"\")","v":""}]
[null,"",{"$f":"IFERROR(VLOOKUP(INDIRECT($A$5&ROW($A1294)),'State Lookup'!$A:$B,2,FALSE),\"\")","v":""}]
[null,"",{"$f":"IFERROR(VLOOKUP(INDIRECT($A$5&ROW($A1295)),'State Lookup'!$A:$B,2,FALSE),\"\")","v":""}]
[null,"",{"$f":"IFERROR(VLOOKUP(INDIRECT($A$5&ROW($A1296)),'State Lookup'!$A:$B,2,FALSE),\"\")","v":""}]
[null,"",{"$f":"IFERROR(VLOOKUP(INDIRECT($A$5&ROW($A1297)),'State Lookup'!$A:$B,2,FALSE),\"\")","v":""}]
[null,"",{"$f":"IFERROR(VLOOKUP(INDIRECT($A$5&ROW($A1298)),'State Lookup'!$A:$B,2,FALSE),\"\")","v":""}]
[null,"",{"$f":"IFERROR(VLOOKUP(INDIRECT($A$5&ROW($A1299)),'State Lookup'!$A:$B,2,FALSE),\"\")","v":""}]
[null,"",{"$f":"IFERROR(VLOOKUP(INDIRECT($A$5&ROW($A1300)),'State Lookup'!$A:$B,2,FALSE),\"\")","v":""}]
[null,"",{"$f":"IFERROR(VLOOKUP(INDIRECT($A$5&ROW($A1301)),'State Lookup'!$A:$B,2,FALSE),\"\")","v":""}]
[null,"",{"$f":"IFERROR(VLOOKUP(INDIRECT($A$5&ROW($A1302)),'State Lookup'!$A:$B,2,FALSE),\"\")","v":""}]
[null,"",{"$f":"IFERROR(VLOOKUP(INDIRECT($A$5&ROW($A1303)),'State Lookup'!$A:$B,2,FALSE),\"\")","v":""}]
[null,"",{"$f":"IFERROR(VLOOKUP(INDIRECT($A$5&ROW($A1304)),'State Lookup'!$A:$B,2,FALSE),\"\")","v":""}]
[null,"",{"$f":"IFERROR(VLOOKUP(INDIRECT($A$5&ROW($A1305)),'State Lookup'!$A:$B,2,FALSE),\"\")","v":""}]
[null,"",{"$f":"IFERROR(VLOOKUP(INDIRECT($A$5&ROW($A1306)),'State Lookup'!$A:$B,2,FALSE),\"\")","v":""}]
[null,"",{"$f":"IFERROR(VLOOKUP(INDIRECT($A$5&ROW($A1307)),'State Lookup'!$A:$B,2,FALSE),\"\")","v":""}]
[null,"",{"$f":"IFERROR(VLOOKUP(INDIRECT($A$5&ROW($A1308)),'State Lookup'!$A:$B,2,FALSE),\"\")","v":""}]
[null,"",{"$f":"IFERROR(VLOOKUP(INDIRECT($A$5&ROW($A1309)),'State Lookup'!$A:$B,2,FALSE),\"\")","v":""}]
[null,"",{"$f":"IFERROR(VLOOKUP(INDIRECT($A$5&ROW($A1310)),'State Lookup'!$A:$B,2,FALSE),\"\")","v":""}]
[null,"",{"$f":"IFERROR(VLOOKUP(INDIRECT($A$5&ROW($A1311)),'State Lookup'!$A:$B,2,FALSE),\"\")","v":""}]
[null,"",{"$f":"IFERROR(VLOOKUP(INDIRECT($A$5&ROW($A1312)),'State Lookup'!$A:$B,2,FALSE),\"\")","v":""}]
[null,"",{"$f":"IFERROR(VLOOKUP(INDIRECT($A$5&ROW($A1313)),'State Lookup'!$A:$B,2,FALSE),\"\")","v":""}]
[null,"",{"$f":"IFERROR(VLOOKUP(INDIRECT($A$5&ROW($A1314)),'State Lookup'!$A:$B,2,FALSE),\"\")","v":""}]
[null,"",{"$f":"IFERROR(VLOOKUP(INDIRECT($A$5&ROW($A1315)),'State Lookup'!$A:$B,2,FALSE),\"\")","v":""}]
[null,"",{"$f":"IFERROR(VLOOKUP(INDIRECT($A$5&ROW($A1316)),'State Lookup'!$A:$B,2,FALSE),\"\")","v":""}]
[null,"",{"$f":"IFERROR(VLOOKUP(INDIRECT($A$5&ROW($A1317)),'State Lookup'!$A:$B,2,FALSE),\"\")","v":""}]
[null,"",{"$f":"IFERROR(VLOOKUP(INDIRECT($A$5&ROW($A1318)),'State Lookup'!$A:$B,2,FALSE),\"\")","v":""}]
[null,"",{"$f":"IFERROR(VLOOKUP(INDIRECT($A$5&ROW($A1319)),'State Lookup'!$A:$B,2,FALSE),\"\")","v":""}]
[null,"",{"$f":"IFERROR(VLOOKUP(INDIRECT($A$5&ROW($A1320)),'State Lookup'!$A:$B,2,FALSE),\"\")","v":""}]
[null,"",{"$f":"IFERROR(VLOOKUP(INDIRECT($A$5&ROW($A1321)),'State Lookup'!$A:$B,2,FALSE),\"\")","v":""}]
[null,"",{"$f":"IFERROR(VLOOKUP(INDIRECT($A$5&ROW($A1322)),'State Lookup'!$A:$B,2,FALSE),\"\")","v":""}]
[null,"",{"$f":"IFERROR(VLOOKUP(INDIRECT($A$5&ROW($A1323)),'State Lookup'!$A:$B,2,FALSE),\"\")","v":""}]
[null,"",{"$f":"IFERROR(VLOOKUP(INDIRECT($A$5&ROW($A1324)),'State Lookup'!$A:$B,2,FALSE),\"\")","v":""}]
[null,"",{"$f":"IFERROR(VLOOKUP(INDIRECT($A$5&ROW($A1325)),'State Lookup'!$A:$B,2,FALSE),\"\")","v":""}]
[null,"",{"$f":"IFERROR(VLOOKUP(INDIRECT($A$5&ROW($A1326)),'State Lookup'!$A:$B,2,FALSE),\"\")","v":""}]
[null,"",{"$f":"IFERROR(VLOOKUP(INDIRECT($A$5&ROW($A1327)),'State Lookup'!$A:$B,2,FALSE),\"\")","v":""}]
[null,"",{"$f":"IFERROR(VLOOKUP(INDIRECT($A$5&ROW($A1328)),'State Lookup'!$A:$B,2,FALSE),\"\")","v":""}]
[null,"",{"$f":"IFERROR(VLOOKUP(INDIRECT($A$5&ROW($A1329)),'State Lookup'!$A:$B,2,FALSE),\"\")","v":""}]
[null,"",{"$f":"IFERROR(VLOOKUP(INDIRECT($A$5&ROW($A1330)),'State Lookup'!$A:$B,2,FALSE),\"\")","v":""}]
[null,"",{"$f":"IFERROR(VLOOKUP(INDIRECT($A$5&ROW($A1331)),'State Lookup'!$A:$B,2,FALSE),\"\")","v":""}]
[null,"",{"$f":"IFERROR(VLOOKUP(INDIRECT($A$5&ROW($A1332)),'State Lookup'!$A:$B,2,FALSE),\"\")","v":""}]
[null,"",{"$f":"IFERROR(VLOOKUP(INDIRECT($A$5&ROW($A1333)),'State Lookup'!$A:$B,2,FALSE),\"\")","v":""}]
[null,"",{"$f":"IFERROR(VLOOKUP(INDIRECT($A$5&ROW($A1334)),'State Lookup'!$A:$B,2,FALSE),\"\")","v":""}]
[null,"",{"$f":"IFERROR(VLOOKUP(INDIRECT($A$5&ROW($A1335)),'State Lookup'!$A:$B,2,FALSE),\"\")","v":""}]
[null,"",{"$f":"IFERROR(VLOOKUP(INDIRECT($A$5&ROW($A1336)),'State Lookup'!$A:$B,2,FALSE),\"\")","v":""}]
[null,"",{"$f":"IFERROR(VLOOKUP(INDIRECT($A$5&ROW($A1337)),'State Lookup'!$A:$B,2,FALSE),\"\")","v":""}]
[null,"",{"$f":"IFERROR(VLOOKUP(INDIRECT($A$5&ROW($A1338)),'State Lookup'!$A:$B,2,FALSE),\"\")","v":""}]
[null,"",{"$f":"IFERROR(VLOOKUP(INDIRECT($A$5&ROW($A1339)),'State Lookup'!$A:$B,2,FALSE),\"\")","v":""}]
[null,"",{"$f":"IFERROR(VLOOKUP(INDIRECT($A$5&ROW($A1340)),'State Lookup'!$A:$B,2,FALSE),\"\")","v":""}]
[null,"",{"$f":"IFERROR(VLOOKUP(INDIRECT($A$5&ROW($A1341)),'State Lookup'!$A:$B,2,FALSE),\"\")","v":""}]
[null,"",{"$f":"IFERROR(VLOOKUP(INDIRECT($A$5&ROW($A1342)),'State Lookup'!$A:$B,2,FALSE),\"\")","v":""}]
[null,"",{"$f":"IFERROR(VLOOKUP(INDIRECT($A$5&ROW($A1343)),'State Lookup'!$A:$B,2,FALSE),\"\")","v":""}]
[null,"",{"$f":"IFERROR(VLOOKUP(INDIRECT($A$5&ROW($A1344)),'State Lookup'!$A:$B,2,FALSE),\"\")","v":""}]
[null,"",{"$f":"IFERROR(VLOOKUP(INDIRECT($A$5&ROW($A1345)),'State Lookup'!$A:$B,2,FALSE),\"\")","v":""}]
[null,"",{"$f":"IFERROR(VLOOKUP(INDIRECT($A$5&ROW($A1346)),'State Lookup'!$A:$B,2,FALSE),\"\")","v":""}]
[null,{"$f":"IFERROR((INDIRECT($A$3&ROW($A1347))/INDIRECT($A$1&ROW($A1347)))*100,\"\")","v":""},{"$f":"IFERROR(VLOOKUP(INDIRECT($A$5&ROW($A1347)),'State Lookup'!$A:$B,2,FALSE),\"\")","v":""}]
[null,"",{"$f":"IFERROR(VLOOKUP(INDIRECT($A$5&ROW($A1348)),'State Lookup'!$A:$B,2,FALSE),\"\")","v":""}]
[null,"",{"$f":"IFERROR(VLOOKUP(INDIRECT($A$5&ROW($A1349)),'State Lookup'!$A:$B,2,FALSE),\"\")","v":""}]
[null,"",{"$f":"IFERROR(VLOOKUP(INDIRECT($A$5&ROW($A1350)),'State Lookup'!$A:$B,2,FALSE),\"\")","v":""}]
[null,"",{"$f":"IFERROR(VLOOKUP(INDIRECT($A$5&ROW($A1351)),'State Lookup'!$A:$B,2,FALSE),\"\")","v":""}]
[null,"",{"$f":"IFERROR(VLOOKUP(INDIRECT($A$5&ROW($A1352)),'State Lookup'!$A:$B,2,FALSE),\"\")","v":""}]
[null,"",{"$f":"IFERROR(VLOOKUP(INDIRECT($A$5&ROW($A1353)),'State Lookup'!$A:$B,2,FALSE),\"\")","v":""}]
[null,"",{"$f":"IFERROR(VLOOKUP(INDIRECT($A$5&ROW($A1354)),'State Lookup'!$A:$B,2,FALSE),\"\")","v":""}]
[null,"",{"$f":"IFERROR(VLOOKUP(INDIRECT($A$5&ROW($A1355)),'State Lookup'!$A:$B,2,FALSE),\"\")","v":""}]
[null,"",{"$f":"IFERROR(VLOOKUP(INDIRECT($A$5&ROW($A1356)),'State Lookup'!$A:$B,2,FALSE),\"\")","v":""}]
[null,"",{"$f":"IFERROR(VLOOKUP(INDIRECT($A$5&ROW($A1357)),'State Lookup'!$A:$B,2,FALSE),\"\")","v":""}]
[null,"",{"$f":"IFERROR(VLOOKUP(INDIRECT($A$5&ROW($A1358)),'State Lookup'!$A:$B,2,FALSE),\"\")","v":""}]
[null,"",{"$f":"IFERROR(VLOOKUP(INDIRECT($A$5&ROW($A1359)),'State Lookup'!$A:$B,2,FALSE),\"\")","v":""}]
[null,"",{"$f":"IFERROR(VLOOKUP(INDIRECT($A$5&ROW($A1360)),'State Lookup'!$A:$B,2,FALSE),\"\")","v":""}]
[null,"",{"$f":"IFERROR(VLOOKUP(INDIRECT($A$5&ROW($A1361)),'State Lookup'!$A:$B,2,FALSE),\"\")","v":""}]
[null,"",{"$f":"IFERROR(VLOOKUP(INDIRECT($A$5&ROW($A1362)),'State Lookup'!$A:$B,2,FALSE),\"\")","v":""}]
[null,"",{"$f":"IFERROR(VLOOKUP(INDIRECT($A$5&ROW($A1363)),'State Lookup'!$A:$B,2,FALSE),\"\")","v":""}]
[null,"",{"$f":"IFERROR(VLOOKUP(INDIRECT($A$5&ROW($A1364)),'State Lookup'!$A:$B,2,FALSE),\"\")","v":""}]
[null,"",{"$f":"IFERROR(VLOOKUP(INDIRECT($A$5&ROW($A1365)),'State Lookup'!$A:$B,2,FALSE),\"\")","v":""}]
[null,"",{"$f":"IFERROR(VLOOKUP(INDIRECT($A$5&ROW($A1366)),'State Lookup'!$A:$B,2,FALSE),\"\")","v":""}]
[null,"",{"$f":"IFERROR(VLOOKUP(INDIRECT($A$5&ROW($A1367)),'State Lookup'!$A:$B,2,FALSE),\"\")","v":""}]
[null,"",{"$f":"IFERROR(VLOOKUP(INDIRECT($A$5&ROW($A1368)),'State Lookup'!$A:$B,2,FALSE),\"\")","v":""}]
[null,"",{"$f":"IFERROR(VLOOKUP(INDIRECT($A$5&ROW($A1369)),'State Lookup'!$A:$B,2,FALSE),\"\")","v":""}]
[null,"",{"$f":"IFERROR(VLOOKUP(INDIRECT($A$5&ROW($A1370)),'State Lookup'!$A:$B,2,FALSE),\"\")","v":""}]
[null,"",{"$f":"IFERROR(VLOOKUP(INDIRECT($A$5&ROW($A1371)),'State Lookup'!$A:$B,2,FALSE),\"\")","v":""}]
[null,"",{"$f":"IFERROR(VLOOKUP(INDIRECT($A$5&ROW($A1372)),'State Lookup'!$A:$B,2,FALSE),\"\")","v":""}]
[null,"",{"$f":"IFERROR(VLOOKUP(INDIRECT($A$5&ROW($A1373)),'State Lookup'!$A:$B,2,FALSE),\"\")","v":""}]
[null,"",{"$f":"IFERROR(VLOOKUP(INDIRECT($A$5&ROW($A1374)),'State Lookup'!$A:$B,2,FALSE),\"\")","v":""}]
[null,"",{"$f":"IFERROR(VLOOKUP(INDIRECT($A$5&ROW($A1375)),'State Lookup'!$A:$B,2,FALSE),\"\")","v":""}]
[null,"",{"$f":"IFERROR(VLOOKUP(INDIRECT($A$5&ROW($A1376)),'State Lookup'!$A:$B,2,FALSE),\"\")","v":""}]
[null,"",{"$f":"IFERROR(VLOOKUP(INDIRECT($A$5&ROW($A1377)),'State Lookup'!$A:$B,2,FALSE),\"\")","v":""}]
[null,"",{"$f":"IFERROR(VLOOKUP(INDIRECT($A$5&ROW($A1378)),'State Lookup'!$A:$B,2,FALSE),\"\")","v":""}]
[null,"",{"$f":"IFERROR(VLOOKUP(INDIRECT($A$5&ROW($A1379)),'State Lookup'!$A:$B,2,FALSE),\"\")","v":""}]
[null,"",{"$f":"IFERROR(VLOOKUP(INDIRECT($A$5&ROW($A1380)),'State Lookup'!$A:$B,2,FALSE),\"\")","v":""}]
[null,"",{"$f":"IFERROR(VLOOKUP(INDIRECT($A$5&ROW($A1381)),'State Lookup'!$A:$B,2,FALSE),\"\")","v":""}]
[null,"",{"$f":"IFERROR(VLOOKUP(INDIRECT($A$5&ROW($A1382)),'State Lookup'!$A:$B,2,FALSE),\"\")","v":""}]
[null,"",{"$f":"IFERROR(VLOOKUP(INDIRECT($A$5&ROW($A1383)),'State Lookup'!$A:$B,2,FALSE),\"\")","v":""}]
[null,"",{"$f":"IFERROR(VLOOKUP(INDIRECT($A$5&ROW($A1384)),'State Lookup'!$A:$B,2,FALSE),\"\")","v":""}]
[null,"",{"$f":"IFERROR(VLOOKUP(INDIRECT($A$5&ROW($A1385)),'State Lookup'!$A:$B,2,FALSE),\"\")","v":""}]
[null,"",{"$f":"IFERROR(VLOOKUP(INDIRECT($A$5&ROW($A1386)),'State Lookup'!$A:$B,2,FALSE),\"\")","v":""}]
[null,"",{"$f":"IFERROR(VLOOKUP(INDIRECT($A$5&ROW($A1387)),'State Lookup'!$A:$B,2,FALSE),\"\")","v":""}]
[null,"",{"$f":"IFERROR(VLOOKUP(INDIRECT($A$5&ROW($A1388)),'State Lookup'!$A:$B,2,FALSE),\"\")","v":""}]
[null,"",{"$f":"IFERROR(VLOOKUP(INDIRECT($A$5&ROW($A1389)),'State Lookup'!$A:$B,2,FALSE),\"\")","v":""}]
[null,"",{"$f":"IFERROR(VLOOKUP(INDIRECT($A$5&ROW($A1390)),'State Lookup'!$A:$B,2,FALSE),\"\")","v":""}]
[null,"",{"$f":"IFERROR(VLOOKUP(INDIRECT($A$5&ROW($A1391)),'State Lookup'!$A:$B,2,FALSE),\"\")","v":""}]
[null,"",{"$f":"IFERROR(VLOOKUP(INDIRECT($A$5&ROW($A1392)),'State Lookup'!$A:$B,2,FALSE),\"\")","v":""}]
[null,"",{"$f":"IFERROR(VLOOKUP(INDIRECT($A$5&ROW($A1393)),'State Lookup'!$A:$B,2,FALSE),\"\")","v":""}]
[null,"",{"$f":"IFERROR(VLOOKUP(INDIRECT($A$5&ROW($A1394)),'State Lookup'!$A:$B,2,FALSE),\"\")","v":""}]
[null,"",{"$f":"IFERROR(VLOOKUP(INDIRECT($A$5&ROW($A1395)),'State Lookup'!$A:$B,2,FALSE),\"\")","v":""}]
[null,"",{"$f":"IFERROR(VLOOKUP(INDIRECT($A$5&ROW($A1396)),'State Lookup'!$A:$B,2,FALSE),\"\")","v":""}]
[null,"",{"$f":"IFERROR(VLOOKUP(INDIRECT($A$5&ROW($A1397)),'State Lookup'!$A:$B,2,FALSE),\"\")","v":""}]
[null,"",{"$f":"IFERROR(VLOOKUP(INDIRECT($A$5&ROW($A1398)),'State Lookup'!$A:$B,2,FALSE),\"\")","v":""}]
[null,"",{"$f":"IFERROR(VLOOKUP(INDIRECT($A$5&ROW($A1399)),'State Lookup'!$A:$B,2,FALSE),\"\")","v":""}]
[null,"",{"$f":"IFERROR(VLOOKUP(INDIRECT($A$5&ROW($A1400)),'State Lookup'!$A:$B,2,FALSE),\"\")","v":""}]
[null,"",{"$f":"IFERROR(VLOOKUP(INDIRECT($A$5&ROW($A1401)),'State Lookup'!$A:$B,2,FALSE),\"\")","v":""}]
[null,"",{"$f":"IFERROR(VLOOKUP(INDIRECT($A$5&ROW($A1402)),'State Lookup'!$A:$B,2,FALSE),\"\")","v":""}]
[null,"",{"$f":"IFERROR(VLOOKUP(INDIRECT($A$5&ROW($A1403)),'State Lookup'!$A:$B,2,FALSE),\"\")","v":""}]
[null,"",{"$f":"IFERROR(VLOOKUP(INDIRECT($A$5&ROW($A1404)),'State Lookup'!$A:$B,2,FALSE),\"\")","v":""}]
[null,"",{"$f":"IFERROR(VLOOKUP(INDIRECT($A$5&ROW($A1405)),'State Lookup'!$A:$B,2,FALSE),\"\")","v":""}]
[null,"",{"$f":"IFERROR(VLOOKUP(INDIRECT($A$5&ROW($A1406)),'State Lookup'!$A:$B,2,FALSE),\"\")","v":""}]
[null,"",{"$f":"IFERROR(VLOOKUP(INDIRECT($A$5&ROW($A1407)),'State Lookup'!$A:$B,2,FALSE),\"\")","v":""}]
[null,"",{"$f":"IFERROR(VLOOKUP(INDIRECT($A$5&ROW($A1408)),'State Lookup'!$A:$B,2,FALSE),\"\")","v":""}]
[null,"",{"$f":"IFERROR(VLOOKUP(INDIRECT($A$5&ROW($A1409)),'State Lookup'!$A:$B,2,FALSE),\"\")","v":""}]
[null,"",{"$f":"IFERROR(VLOOKUP(INDIRECT($A$5&ROW($A1410)),'State Lookup'!$A:$B,2,FALSE),\"\")","v":""}]
[null,{"$f":"IFERROR((INDIRECT($A$3&ROW($A1411))/INDIRECT($A$1&ROW($A1411)))*100,\"\")","v":""},{"$f":"IFERROR(VLOOKUP(INDIRECT($A$5&ROW($A1411)),'State Lookup'!$A:$B,2,FALSE),\"\")","v":""}]
[null,"",{"$f":"IFERROR(VLOOKUP(INDIRECT($A$5&ROW($A1412)),'State Lookup'!$A:$B,2,FALSE),\"\")","v":""}]
[null,"",{"$f":"IFERROR(VLOOKUP(INDIRECT($A$5&ROW($A1413)),'State Lookup'!$A:$B,2,FALSE),\"\")","v":""}]
[null,"",{"$f":"IFERROR(VLOOKUP(INDIRECT($A$5&ROW($A1414)),'State Lookup'!$A:$B,2,FALSE),\"\")","v":""}]
[null,"",{"$f":"IFERROR(VLOOKUP(INDIRECT($A$5&ROW($A1415)),'State Lookup'!$A:$B,2,FALSE),\"\")","v":""}]
[null,"",{"$f":"IFERROR(VLOOKUP(INDIRECT($A$5&ROW($A1416)),'State Lookup'!$A:$B,2,FALSE),\"\")","v":""}]
[null,"",{"$f":"IFERROR(VLOOKUP(INDIRECT($A$5&ROW($A1417)),'State Lookup'!$A:$B,2,FALSE),\"\")","v":""}]
[null,"",{"$f":"IFERROR(VLOOKUP(INDIRECT($A$5&ROW($A1418)),'State Lookup'!$A:$B,2,FALSE),\"\")","v":""}]
[null,"",{"$f":"IFERROR(VLOOKUP(INDIRECT($A$5&ROW($A1419)),'State Lookup'!$A:$B,2,FALSE),\"\")","v":""}]
[null,"",{"$f":"IFERROR(VLOOKUP(INDIRECT($A$5&ROW($A1420)),'State Lookup'!$A:$B,2,FALSE),\"\")","v":""}]
[null,"",{"$f":"IFERROR(VLOOKUP(INDIRECT($A$5&ROW($A1421)),'State Lookup'!$A:$B,2,FALSE),\"\")","v":""}]
[null,"",{"$f":"IFERROR(VLOOKUP(INDIRECT($A$5&ROW($A1422)),'State Lookup'!$A:$B,2,FALSE),\"\")","v":""}]
[null,"",{"$f":"IFERROR(VLOOKUP(INDIRECT($A$5&ROW($A1423)),'State Lookup'!$A:$B,2,FALSE),\"\")","v":""}]
[null,"",{"$f":"IFERROR(VLOOKUP(INDIRECT($A$5&ROW($A1424)),'State Lookup'!$A:$B,2,FALSE),\"\")","v":""}]
[null,"",{"$f":"IFERROR(VLOOKUP(INDIRECT($A$5&ROW($A1425)),'State Lookup'!$A:$B,2,FALSE),\"\")","v":""}]
[null,"",{"$f":"IFERROR(VLOOKUP(INDIRECT($A$5&ROW($A1426)),'State Lookup'!$A:$B,2,FALSE),\"\")","v":""}]
[null,"",{"$f":"IFERROR(VLOOKUP(INDIRECT($A$5&ROW($A1427)),'State Lookup'!$A:$B,2,FALSE),\"\")","v":""}]
[null,"",{"$f":"IFERROR(VLOOKUP(INDIRECT($A$5&ROW($A1428)),'State Lookup'!$A:$B,2,FALSE),\"\")","v":""}]
[null,"",{"$f":"IFERROR(VLOOKUP(INDIRECT($A$5&ROW($A1429)),'State Lookup'!$A:$B,2,FALSE),\"\")","v":""}]
[null,"",{"$f":"IFERROR(VLOOKUP(INDIRECT($A$5&ROW($A1430)),'State Lookup'!$A:$B,2,FALSE),\"\")","v":""}]
[null,"",{"$f":"IFERROR(VLOOKUP(INDIRECT($A$5&ROW($A1431)),'State Lookup'!$A:$B,2,FALSE),\"\")","v":""}]
[null,"",{"$f":"IFERROR(VLOOKUP(INDIRECT($A$5&ROW($A1432)),'State Lookup'!$A:$B,2,FALSE),\"\")","v":""}]
[null,"",{"$f":"IFERROR(VLOOKUP(INDIRECT($A$5&ROW($A1433)),'State Lookup'!$A:$B,2,FALSE),\"\")","v":""}]
[null,"",{"$f":"IFERROR(VLOOKUP(INDIRECT($A$5&ROW($A1434)),'State Lookup'!$A:$B,2,FALSE),\"\")","v":""}]
[null,"",{"$f":"IFERROR(VLOOKUP(INDIRECT($A$5&ROW($A1435)),'State Lookup'!$A:$B,2,FALSE),\"\")","v":""}]
[null,"",{"$f":"IFERROR(VLOOKUP(INDIRECT($A$5&ROW($A1436)),'State Lookup'!$A:$B,2,FALSE),\"\")","v":""}]
[null,"",{"$f":"IFERROR(VLOOKUP(INDIRECT($A$5&ROW($A1437)),'State Lookup'!$A:$B,2,FALSE),\"\")","v":""}]
[null,"",{"$f":"IFERROR(VLOOKUP(INDIRECT($A$5&ROW($A1438)),'State Lookup'!$A:$B,2,FALSE),\"\")","v":""}]
[null,"",{"$f":"IFERROR(VLOOKUP(INDIRECT($A$5&ROW($A1439)),'State Lookup'!$A:$B,2,FALSE),\"\")","v":""}]
[null,"",{"$f":"IFERROR(VLOOKUP(INDIRECT($A$5&ROW($A1440)),'State Lookup'!$A:$B,2,FALSE),\"\")","v":""}]
[null,"",{"$f":"IFERROR(VLOOKUP(INDIRECT($A$5&ROW($A1441)),'State Lookup'!$A:$B,2,FALSE),\"\")","v":""}]
[null,"",{"$f":"IFERROR(VLOOKUP(INDIRECT($A$5&ROW($A1442)),'State Lookup'!$A:$B,2,FALSE),\"\")","v":""}]
[null,"",{"$f":"IFERROR(VLOOKUP(INDIRECT($A$5&ROW($A1443)),'State Lookup'!$A:$B,2,FALSE),\"\")","v":""}]
[null,"",{"$f":"IFERROR(VLOOKUP(INDIRECT($A$5&ROW($A1444)),'State Lookup'!$A:$B,2,FALSE),\"\")","v":""}]
[null,"",{"$f":"IFERROR(VLOOKUP(INDIRECT($A$5&ROW($A1445)),'State Lookup'!$A:$B,2,FALSE),\"\")","v":""}]
[null,"",{"$f":"IFERROR(VLOOKUP(INDIRECT($A$5&ROW($A1446)),'State Lookup'!$A:$B,2,FALSE),\"\")","v":""}]
[null,"",{"$f":"IFERROR(VLOOKUP(INDIRECT($A$5&ROW($A1447)),'State Lookup'!$A:$B,2,FALSE),\"\")","v":""}]
[null,"",{"$f":"IFERROR(VLOOKUP(INDIRECT($A$5&ROW($A1448)),'State Lookup'!$A:$B,2,FALSE),\"\")","v":""}]
[null,"",{"$f":"IFERROR(VLOOKUP(INDIRECT($A$5&ROW($A1449)),'State Lookup'!$A:$B,2,FALSE),\"\")","v":""}]
[null,"",{"$f":"IFERROR(VLOOKUP(INDIRECT($A$5&ROW($A1450)),'State Lookup'!$A:$B,2,FALSE),\"\")","v":""}]
[null,"",{"$f":"IFERROR(VLOOKUP(INDIRECT($A$5&ROW($A1451)),'State Lookup'!$A:$B,2,FALSE),\"\")","v":""}]
[null,"",{"$f":"IFERROR(VLOOKUP(INDIRECT($A$5&ROW($A1452)),'State Lookup'!$A:$B,2,FALSE),\"\")","v":""}]
[null,"",{"$f":"IFERROR(VLOOKUP(INDIRECT($A$5&ROW($A1453)),'State Lookup'!$A:$B,2,FALSE),\"\")","v":""}]
[null,"",{"$f":"IFERROR(VLOOKUP(INDIRECT($A$5&ROW($A1454)),'State Lookup'!$A:$B,2,FALSE),\"\")","v":""}]
[null,"",{"$f":"IFERROR(VLOOKUP(INDIRECT($A$5&ROW($A1455)),'State Lookup'!$A:$B,2,FALSE),\"\")","v":""}]
[null,"",{"$f":"IFERROR(VLOOKUP(INDIRECT($A$5&ROW($A1456)),'State Lookup'!$A:$B,2,FALSE),\"\")","v":""}]
[null,"",{"$f":"IFERROR(VLOOKUP(INDIRECT($A$5&ROW($A1457)),'State Lookup'!$A:$B,2,FALSE),\"\")","v":""}]
[null,"",{"$f":"IFERROR(VLOOKUP(INDIRECT($A$5&ROW($A1458)),'State Lookup'!$A:$B,2,FALSE),\"\")","v":""}]
[null,"",{"$f":"IFERROR(VLOOKUP(INDIRECT($A$5&ROW($A1459)),'State Lookup'!$A:$B,2,FALSE),\"\")","v":""}]
[null,"",{"$f":"IFERROR(VLOOKUP(INDIRECT($A$5&ROW($A1460)),'State Lookup'!$A:$B,2,FALSE),\"\")","v":""}]
[null,"",{"$f":"IFERROR(VLOOKUP(INDIRECT($A$5&ROW($A1461)),'State Lookup'!$A:$B,2,FALSE),\"\")","v":""}]
[null,"",{"$f":"IFERROR(VLOOKUP(INDIRECT($A$5&ROW($A1462)),'State Lookup'!$A:$B,2,FALSE),\"\")","v":""}]
[null,"",{"$f":"IFERROR(VLOOKUP(INDIRECT($A$5&ROW($A1463)),'State Lookup'!$A:$B,2,FALSE),\"\")","v":""}]
[null,"",{"$f":"IFERROR(VLOOKUP(INDIRECT($A$5&ROW($A1464)),'State Lookup'!$A:$B,2,FALSE),\"\")","v":""}]
[null,"",{"$f":"IFERROR(VLOOKUP(INDIRECT($A$5&ROW($A1465)),'State Lookup'!$A:$B,2,FALSE),\"\")","v":""}]
[null,"",{"$f":"IFERROR(VLOOKUP(INDIRECT($A$5&ROW($A1466)),'State Lookup'!$A:$B,2,FALSE),\"\")","v":""}]
[null,"",{"$f":"IFERROR(VLOOKUP(INDIRECT($A$5&ROW($A1467)),'State Lookup'!$A:$B,2,FALSE),\"\")","v":""}]
[null,"",{"$f":"IFERROR(VLOOKUP(INDIRECT($A$5&ROW($A1468)),'State Lookup'!$A:$B,2,FALSE),\"\")","v":""}]
[null,"",{"$f":"IFERROR(VLOOKUP(INDIRECT($A$5&ROW($A1469)),'State Lookup'!$A:$B,2,FALSE),\"\")","v":""}]
[null,"",{"$f":"IFERROR(VLOOKUP(INDIRECT($A$5&ROW($A1470)),'State Lookup'!$A:$B,2,FALSE),\"\")","v":""}]
[null,"",{"$f":"IFERROR(VLOOKUP(INDIRECT($A$5&ROW($A1471)),'State Lookup'!$A:$B,2,FALSE),\"\")","v":""}]
[null,"",{"$f":"IFERROR(VLOOKUP(INDIRECT($A$5&ROW($A1472)),'State Lookup'!$A:$B,2,FALSE),\"\")","v":""}]
[null,"",{"$f":"IFERROR(VLOOKUP(INDIRECT($A$5&ROW($A1473)),'State Lookup'!$A:$B,2,FALSE),\"\")","v":""}]
[null,"",{"$f":"IFERROR(VLOOKUP(INDIRECT($A$5&ROW($A1474)),'State Lookup'!$A:$B,2,FALSE),\"\")","v":""}]
[null,{"$f":"IFERROR((INDIRECT($A$3&ROW($A1475))/INDIRECT($A$1&ROW($A1475)))*100,\"\")","v":""},{"$f":"IFERROR(VLOOKUP(INDIRECT($A$5&ROW($A1475)),'State Lookup'!$A:$B,2,FALSE),\"\")","v":""}]
[null,"",{"$f":"IFERROR(VLOOKUP(INDIRECT($A$5&ROW($A1476)),'State Lookup'!$A:$B,2,FALSE),\"\")","v":""}]
[null,"",{"$f":"IFERROR(VLOOKUP(INDIRECT($A$5&ROW($A1477)),'State Lookup'!$A:$B,2,FALSE),\"\")","v":""}]
[null,"",{"$f":"IFERROR(VLOOKUP(INDIRECT($A$5&ROW($A1478)),'State Lookup'!$A:$B,2,FALSE),\"\")","v":""}]
[null,"",{"$f":"IFERROR(VLOOKUP(INDIRECT($A$5&ROW($A1479)),'State Lookup'!$A:$B,2,FALSE),\"\")","v":""}]
[null,"",{"$f":"IFERROR(VLOOKUP(INDIRECT($A$5&ROW($A1480)),'State Lookup'!$A:$B,2,FALSE),\"\")","v":""}]
[null,"",{"$f":"IFERROR(VLOOKUP(INDIRECT($A$5&ROW($A1481)),'State Lookup'!$A:$B,2,FALSE),\"\")","v":""}]
[null,"",{"$f":"IFERROR(VLOOKUP(INDIRECT($A$5&ROW($A1482)),'State Lookup'!$A:$B,2,FALSE),\"\")","v":""}]
[null,"",{"$f":"IFERROR(VLOOKUP(INDIRECT($A$5&ROW($A1483)),'State Lookup'!$A:$B,2,FALSE),\"\")","v":""}]
[null,"",{"$f":"IFERROR(VLOOKUP(INDIRECT($A$5&ROW($A1484)),'State Lookup'!$A:$B,2,FALSE),\"\")","v":""}]
[null,"",{"$f":"IFERROR(VLOOKUP(INDIRECT($A$5&ROW($A1485)),'State Lookup'!$A:$B,2,FALSE),\"\")","v":""}]
[null,"",{"$f":"IFERROR(VLOOKUP(INDIRECT($A$5&ROW($A1486)),'State Lookup'!$A:$B,2,FALSE),\"\")","v":""}]
[null,"",{"$f":"IFERROR(VLOOKUP(INDIRECT($A$5&ROW($A1487)),'State Lookup'!$A:$B,2,FALSE),\"\")","v":""}]
[null,"",{"$f":"IFERROR(VLOOKUP(INDIRECT($A$5&ROW($A1488)),'State Lookup'!$A:$B,2,FALSE),\"\")","v":""}]
[null,"",{"$f":"IFERROR(VLOOKUP(INDIRECT($A$5&ROW($A1489)),'State Lookup'!$A:$B,2,FALSE),\"\")","v":""}]
[null,"",{"$f":"IFERROR(VLOOKUP(INDIRECT($A$5&ROW($A1490)),'State Lookup'!$A:$B,2,FALSE),\"\")","v":""}]
[null,"",{"$f":"IFERROR(VLOOKUP(INDIRECT($A$5&ROW($A1491)),'State Lookup'!$A:$B,2,FALSE),\"\")","v":""}]
[null,"",{"$f":"IFERROR(VLOOKUP(INDIRECT($A$5&ROW($A1492)),'State Lookup'!$A:$B,2,FALSE),\"\")","v":""}]
[null,"",{"$f":"IFERROR(VLOOKUP(INDIRECT($A$5&ROW($A1493)),'State Lookup'!$A:$B,2,FALSE),\"\")","v":""}]
[null,"",{"$f":"IFERROR(VLOOKUP(INDIRECT($A$5&ROW($A1494)),'State Lookup'!$A:$B,2,FALSE),\"\")","v":""}]
[null,"",{"$f":"IFERROR(VLOOKUP(INDIRECT($A$5&ROW($A1495)),'State Lookup'!$A:$B,2,FALSE),\"\")","v":""}]
[null,"",{"$f":"IFERROR(VLOOKUP(INDIRECT($A$5&ROW($A1496)),'State Lookup'!$A:$B,2,FALSE),\"\")","v":""}]
[null,"",{"$f":"IFERROR(VLOOKUP(INDIRECT($A$5&ROW($A1497)),'State Lookup'!$A:$B,2,FALSE),\"\")","v":""}]
[null,"",{"$f":"IFERROR(VLOOKUP(INDIRECT($A$5&ROW($A1498)),'State Lookup'!$A:$B,2,FALSE),\"\")","v":""}]
[null,"",{"$f":"IFERROR(VLOOKUP(INDIRECT($A$5&ROW($A1499)),'State Lookup'!$A:$B,2,FALSE),\"\")","v":""}]
[null,"",{"$f":"IFERROR(VLOOKUP(INDIRECT($A$5&ROW($A1500)),'State Lookup'!$A:$B,2,FALSE),\"\")","v":""}]
[null,"",{"$f":"IFERROR(VLOOKUP(INDIRECT($A$5&ROW($A1501)),'State Lookup'!$A:$B,2,FALSE),\"\")","v":""}]
[null,"",{"$f":"IFERROR(VLOOKUP(INDIRECT($A$5&ROW($A1502)),'State Lookup'!$A:$B,2,FALSE),\"\")","v":""}]
[null,"",{"$f":"IFERROR(VLOOKUP(INDIRECT($A$5&ROW($A1503)),'State Lookup'!$A:$B,2,FALSE),\"\")","v":""}]
[null,"",{"$f":"IFERROR(VLOOKUP(INDIRECT($A$5&ROW($A1504)),'State Lookup'!$A:$B,2,FALSE),\"\")","v":""}]
[null,"",{"$f":"IFERROR(VLOOKUP(INDIRECT($A$5&ROW($A1505)),'State Lookup'!$A:$B,2,FALSE),\"\")","v":""}]
[null,"",{"$f":"IFERROR(VLOOKUP(INDIRECT($A$5&ROW($A1506)),'State Lookup'!$A:$B,2,FALSE),\"\")","v":""}]
[null,"",{"$f":"IFERROR(VLOOKUP(INDIRECT($A$5&ROW($A1507)),'State Lookup'!$A:$B,2,FALSE),\"\")","v":""}]
[null,"",{"$f":"IFERROR(VLOOKUP(INDIRECT($A$5&ROW($A1508)),'State Lookup'!$A:$B,2,FALSE),\"\")","v":""}]
[null,"",{"$f":"IFERROR(VLOOKUP(INDIRECT($A$5&ROW($A1509)),'State Lookup'!$A:$B,2,FALSE),\"\")","v":""}]
[null,"",{"$f":"IFERROR(VLOOKUP(INDIRECT($A$5&ROW($A1510)),'State Lookup'!$A:$B,2,FALSE),\"\")","v":""}]
[null,"",{"$f":"IFERROR(VLOOKUP(INDIRECT($A$5&ROW($A1511)),'State Lookup'!$A:$B,2,FALSE),\"\")","v":""}]
[null,"",{"$f":"IFERROR(VLOOKUP(INDIRECT($A$5&ROW($A1512)),'State Lookup'!$A:$B,2,FALSE),\"\")","v":""}]
[null,"",{"$f":"IFERROR(VLOOKUP(INDIRECT($A$5&ROW($A1513)),'State Lookup'!$A:$B,2,FALSE),\"\")","v":""}]
[null,"",{"$f":"IFERROR(VLOOKUP(INDIRECT($A$5&ROW($A1514)),'State Lookup'!$A:$B,2,FALSE),\"\")","v":""}]
[null,"",{"$f":"IFERROR(VLOOKUP(INDIRECT($A$5&ROW($A1515)),'State Lookup'!$A:$B,2,FALSE),\"\")","v":""}]
[null,"",{"$f":"IFERROR(VLOOKUP(INDIRECT($A$5&ROW($A1516)),'State Lookup'!$A:$B,2,FALSE),\"\")","v":""}]
[null,"",{"$f":"IFERROR(VLOOKUP(INDIRECT($A$5&ROW($A1517)),'State Lookup'!$A:$B,2,FALSE),\"\")","v":""}]
[null,"",{"$f":"IFERROR(VLOOKUP(INDIRECT($A$5&ROW($A1518)),'State Lookup'!$A:$B,2,FALSE),\"\")","v":""}]
[null,"",{"$f":"IFERROR(VLOOKUP(INDIRECT($A$5&ROW($A1519)),'State Lookup'!$A:$B,2,FALSE),\"\")","v":""}]
[null,"",{"$f":"IFERROR(VLOOKUP(INDIRECT($A$5&ROW($A1520)),'State Lookup'!$A:$B,2,FALSE),\"\")","v":""}]
[null,"",{"$f":"IFERROR(VLOOKUP(INDIRECT($A$5&ROW($A1521)),'State Lookup'!$A:$B,2,FALSE),\"\")","v":""}]
[null,"",{"$f":"IFERROR(VLOOKUP(INDIRECT($A$5&ROW($A1522)),'State Lookup'!$A:$B,2,FALSE),\"\")","v":""}]
[null,"",{"$f":"IFERROR(VLOOKUP(INDIRECT($A$5&ROW($A1523)),'State Lookup'!$A:$B,2,FALSE),\"\")","v":""}]
[null,"",{"$f":"IFERROR(VLOOKUP(INDIRECT($A$5&ROW($A1524)),'State Lookup'!$A:$B,2,FALSE),\"\")","v":""}]
[null,"",{"$f":"IFERROR(VLOOKUP(INDIRECT($A$5&ROW($A1525)),'State Lookup'!$A:$B,2,FALSE),\"\")","v":""}]
[null,"",{"$f":"IFERROR(VLOOKUP(INDIRECT($A$5&ROW($A1526)),'State Lookup'!$A:$B,2,FALSE),\"\")","v":""}]
[null,"",{"$f":"IFERROR(VLOOKUP(INDIRECT($A$5&ROW($A1527)),'State Lookup'!$A:$B,2,FALSE),\"\")","v":""}]
[null,"",{"$f":"IFERROR(VLOOKUP(INDIRECT($A$5&ROW($A1528)),'State Lookup'!$A:$B,2,FALSE),\"\")","v":""}]
[null,"",{"$f":"IFERROR(VLOOKUP(INDIRECT($A$5&ROW($A1529)),'State Lookup'!$A:$B,2,FALSE),\"\")","v":""}]
[null,"",{"$f":"IFERROR(VLOOKUP(INDIRECT($A$5&ROW($A1530)),'State Lookup'!$A:$B,2,FALSE),\"\")","v":""}]
[null,"",{"$f":"IFERROR(VLOOKUP(INDIRECT($A$5&ROW($A1531)),'State Lookup'!$A:$B,2,FALSE),\"\")","v":""}]
[null,"",{"$f":"IFERROR(VLOOKUP(INDIRECT($A$5&ROW($A1532)),'State Lookup'!$A:$B,2,FALSE),\"\")","v":""}]
[null,"",{"$f":"IFERROR(VLOOKUP(INDIRECT($A$5&ROW($A1533)),'State Lookup'!$A:$B,2,FALSE),\"\")","v":""}]
[null,"",{"$f":"IFERROR(VLOOKUP(INDIRECT($A$5&ROW($A1534)),'State Lookup'!$A:$B,2,FALSE),\"\")","v":""}]
[null,"",{"$f":"IFERROR(VLOOKUP(INDIRECT($A$5&ROW($A1535)),'State Lookup'!$A:$B,2,FALSE),\"\")","v":""}]
[null,"",{"$f":"IFERROR(VLOOKUP(INDIRECT($A$5&ROW($A1536)),'State Lookup'!$A:$B,2,FALSE),\"\")","v":""}]
[null,"",{"$f":"IFERROR(VLOOKUP(INDIRECT($A$5&ROW($A1537)),'State Lookup'!$A:$B,2,FALSE),\"\")","v":""}]
[null,"",{"$f":"IFERROR(VLOOKUP(INDIRECT($A$5&ROW($A1538)),'State Lookup'!$A:$B,2,FALSE),\"\")","v":""}]
[null,{"$f":"IFERROR((INDIRECT($A$3&ROW($A1539))/INDIRECT($A$1&ROW($A1539)))*100,\"\")","v":""},{"$f":"IFERROR(VLOOKUP(INDIRECT($A$5&ROW($A1539)),'State Lookup'!$A:$B,2,FALSE),\"\")","v":""}]
[null,"",{"$f":"IFERROR(VLOOKUP(INDIRECT($A$5&ROW($A1540)),'State Lookup'!$A:$B,2,FALSE),\"\")","v":""}]
[null,"",{"$f":"IFERROR(VLOOKUP(INDIRECT($A$5&ROW($A1541)),'State Lookup'!$A:$B,2,FALSE),\"\")","v":""}]
[null,"",{"$f":"IFERROR(VLOOKUP(INDIRECT($A$5&ROW($A1542)),'State Lookup'!$A:$B,2,FALSE),\"\")","v":""}]
[null,"",{"$f":"IFERROR(VLOOKUP(INDIRECT($A$5&ROW($A1543)),'State Lookup'!$A:$B,2,FALSE),\"\")","v":""}]
[null,"",{"$f":"IFERROR(VLOOKUP(INDIRECT($A$5&ROW($A1544)),'State Lookup'!$A:$B,2,FALSE),\"\")","v":""}]
[null,"",{"$f":"IFERROR(VLOOKUP(INDIRECT($A$5&ROW($A1545)),'State Lookup'!$A:$B,2,FALSE),\"\")","v":""}]
[null,"",{"$f":"IFERROR(VLOOKUP(INDIRECT($A$5&ROW($A1546)),'State Lookup'!$A:$B,2,FALSE),\"\")","v":""}]
[null,"",{"$f":"IFERROR(VLOOKUP(INDIRECT($A$5&ROW($A1547)),'State Lookup'!$A:$B,2,FALSE),\"\")","v":""}]
[null,"",{"$f":"IFERROR(VLOOKUP(INDIRECT($A$5&ROW($A1548)),'State Lookup'!$A:$B,2,FALSE),\"\")","v":""}]
[null,"",{"$f":"IFERROR(VLOOKUP(INDIRECT($A$5&ROW($A1549)),'State Lookup'!$A:$B,2,FALSE),\"\")","v":""}]
[null,"",{"$f":"IFERROR(VLOOKUP(INDIRECT($A$5&ROW($A1550)),'State Lookup'!$A:$B,2,FALSE),\"\")","v":""}]
[null,"",{"$f":"IFERROR(VLOOKUP(INDIRECT($A$5&ROW($A1551)),'State Lookup'!$A:$B,2,FALSE),\"\")","v":""}]
[null,"",{"$f":"IFERROR(VLOOKUP(INDIRECT($A$5&ROW($A1552)),'State Lookup'!$A:$B,2,FALSE),\"\")","v":""}]
[null,"",{"$f":"IFERROR(VLOOKUP(INDIRECT($A$5&ROW($A1553)),'State Lookup'!$A:$B,2,FALSE),\"\")","v":""}]
[null,"",{"$f":"IFERROR(VLOOKUP(INDIRECT($A$5&ROW($A1554)),'State Lookup'!$A:$B,2,FALSE),\"\")","v":""}]
[null,"",{"$f":"IFERROR(VLOOKUP(INDIRECT($A$5&ROW($A1555)),'State Lookup'!$A:$B,2,FALSE),\"\")","v":""}]
[null,"",{"$f":"IFERROR(VLOOKUP(INDIRECT($A$5&ROW($A1556)),'State Lookup'!$A:$B,2,FALSE),\"\")","v":""}]
[null,"",{"$f":"IFERROR(VLOOKUP(INDIRECT($A$5&ROW($A1557)),'State Lookup'!$A:$B,2,FALSE),\"\")","v":""}]
[null,"",{"$f":"IFERROR(VLOOKUP(INDIRECT($A$5&ROW($A1558)),'State Lookup'!$A:$B,2,FALSE),\"\")","v":""}]
[null,"",{"$f":"IFERROR(VLOOKUP(INDIRECT($A$5&ROW($A1559)),'State Lookup'!$A:$B,2,FALSE),\"\")","v":""}]
[null,"",{"$f":"IFERROR(VLOOKUP(INDIRECT($A$5&ROW($A1560)),'State Lookup'!$A:$B,2,FALSE),\"\")","v":""}]
[null,"",{"$f":"IFERROR(VLOOKUP(INDIRECT($A$5&ROW($A1561)),'State Lookup'!$A:$B,2,FALSE),\"\")","v":""}]
[null,"",{"$f":"IFERROR(VLOOKUP(INDIRECT($A$5&ROW($A1562)),'State Lookup'!$A:$B,2,FALSE),\"\")","v":""}]
[null,"",{"$f":"IFERROR(VLOOKUP(INDIRECT($A$5&ROW($A1563)),'State Lookup'!$A:$B,2,FALSE),\"\")","v":""}]
[null,"",{"$f":"IFERROR(VLOOKUP(INDIRECT($A$5&ROW($A1564)),'State Lookup'!$A:$B,2,FALSE),\"\")","v":""}]
[null,"",{"$f":"IFERROR(VLOOKUP(INDIRECT($A$5&ROW($A1565)),'State Lookup'!$A:$B,2,FALSE),\"\")","v":""}]
[null,"",{"$f":"IFERROR(VLOOKUP(INDIRECT($A$5&ROW($A1566)),'State Lookup'!$A:$B,2,FALSE),\"\")","v":""}]
[null,"",{"$f":"IFERROR(VLOOKUP(INDIRECT($A$5&ROW($A1567)),'State Lookup'!$A:$B,2,FALSE),\"\")","v":""}]
[null,"",{"$f":"IFERROR(VLOOKUP(INDIRECT($A$5&ROW($A1568)),'State Lookup'!$A:$B,2,FALSE),\"\")","v":""}]
[null,"",{"$f":"IFERROR(VLOOKUP(INDIRECT($A$5&ROW($A1569)),'State Lookup'!$A:$B,2,FALSE),\"\")","v":""}]
[null,"",{"$f":"IFERROR(VLOOKUP(INDIRECT($A$5&ROW($A1570)),'State Lookup'!$A:$B,2,FALSE),\"\")","v":""}]
[null,"",{"$f":"IFERROR(VLOOKUP(INDIRECT($A$5&ROW($A1571)),'State Lookup'!$A:$B,2,FALSE),\"\")","v":""}]
[null,"",{"$f":"IFERROR(VLOOKUP(INDIRECT($A$5&ROW($A1572)),'State Lookup'!$A:$B,2,FALSE),\"\")","v":""}]
[null,"",{"$f":"IFERROR(VLOOKUP(INDIRECT($A$5&ROW($A1573)),'State Lookup'!$A:$B,2,FALSE),\"\")","v":""}]
[null,"",{"$f":"IFERROR(VLOOKUP(INDIRECT($A$5&ROW($A1574)),'State Lookup'!$A:$B,2,FALSE),\"\")","v":""}]
[null,"",{"$f":"IFERROR(VLOOKUP(INDIRECT($A$5&ROW($A1575)),'State Lookup'!$A:$B,2,FALSE),\"\")","v":""}]
[null,"",{"$f":"IFERROR(VLOOKUP(INDIRECT($A$5&ROW($A1576)),'State Lookup'!$A:$B,2,FALSE),\"\")","v":""}]
[null,"",{"$f":"IFERROR(VLOOKUP(INDIRECT($A$5&ROW($A1577)),'State Lookup'!$A:$B,2,FALSE),\"\")","v":""}]
[null,"",{"$f":"IFERROR(VLOOKUP(INDIRECT($A$5&ROW($A1578)),'State Lookup'!$A:$B,2,FALSE),\"\")","v":""}]
[null,"",{"$f":"IFERROR(VLOOKUP(INDIRECT($A$5&ROW($A1579)),'State Lookup'!$A:$B,2,FALSE),\"\")","v":""}]
[null,"",{"$f":"IFERROR(VLOOKUP(INDIRECT($A$5&ROW($A1580)),'State Lookup'!$A:$B,2,FALSE),\"\")","v":""}]
[null,"",{"$f":"IFERROR(VLOOKUP(INDIRECT($A$5&ROW($A1581)),'State Lookup'!$A:$B,2,FALSE),\"\")","v":""}]
[null,"",{"$f":"IFERROR(VLOOKUP(INDIRECT($A$5&ROW($A1582)),'State Lookup'!$A:$B,2,FALSE),\"\")","v":""}]
[null,"",{"$f":"IFERROR(VLOOKUP(INDIRECT($A$5&ROW($A1583)),'State Lookup'!$A:$B,2,FALSE),\"\")","v":""}]
[null,"",{"$f":"IFERROR(VLOOKUP(INDIRECT($A$5&ROW($A1584)),'State Lookup'!$A:$B,2,FALSE),\"\")","v":""}]
[null,"",{"$f":"IFERROR(VLOOKUP(INDIRECT($A$5&ROW($A1585)),'State Lookup'!$A:$B,2,FALSE),\"\")","v":""}]
[null,"",{"$f":"IFERROR(VLOOKUP(INDIRECT($A$5&ROW($A1586)),'State Lookup'!$A:$B,2,FALSE),\"\")","v":""}]
[null,"",{"$f":"IFERROR(VLOOKUP(INDIRECT($A$5&ROW($A1587)),'State Lookup'!$A:$B,2,FALSE),\"\")","v":""}]
[null,"",{"$f":"IFERROR(VLOOKUP(INDIRECT($A$5&ROW($A1588)),'State Lookup'!$A:$B,2,FALSE),\"\")","v":""}]
[null,"",{"$f":"IFERROR(VLOOKUP(INDIRECT($A$5&ROW($A1589)),'State Lookup'!$A:$B,2,FALSE),\"\")","v":""}]
[null,"",{"$f":"IFERROR(VLOOKUP(INDIRECT($A$5&ROW($A1590)),'State Lookup'!$A:$B,2,FALSE),\"\")","v":""}]
[null,"",{"$f":"IFERROR(VLOOKUP(INDIRECT($A$5&ROW($A1591)),'State Lookup'!$A:$B,2,FALSE),\"\")","v":""}]
[null,"",{"$f":"IFERROR(VLOOKUP(INDIRECT($A$5&ROW($A1592)),'State Lookup'!$A:$B,2,FALSE),\"\")","v":""}]
[null,"",{"$f":"IFERROR(VLOOKUP(INDIRECT($A$5&ROW($A1593)),'State Lookup'!$A:$B,2,FALSE),\"\")","v":""}]
[null,"",{"$f":"IFERROR(VLOOKUP(INDIRECT($A$5&ROW($A1594)),'State Lookup'!$A:$B,2,FALSE),\"\")","v":""}]
[null,"",{"$f":"IFERROR(VLOOKUP(INDIRECT($A$5&ROW($A1595)),'State Lookup'!$A:$B,2,FALSE),\"\")","v":""}]
[null,"",{"$f":"IFERROR(VLOOKUP(INDIRECT($A$5&ROW($A1596)),'State Lookup'!$A:$B,2,FALSE),\"\")","v":""}]
[null,"",{"$f":"IFERROR(VLOOKUP(INDIRECT($A$5&ROW($A1597)),'State Lookup'!$A:$B,2,FALSE),\"\")","v":""}]
[null,"",{"$f":"IFERROR(VLOOKUP(INDIRECT($A$5&ROW($A1598)),'State Lookup'!$A:$B,2,FALSE),\"\")","v":""}]
[null,"",{"$f":"IFERROR(VLOOKUP(INDIRECT($A$5&ROW($A1599)),'State Lookup'!$A:$B,2,FALSE),\"\")","v":""}]
[null,"",{"$f":"IFERROR(VLOOKUP(INDIRECT($A$5&ROW($A1600)),'State Lookup'!$A:$B,2,FALSE),\"\")","v":""}]
[null,"",{"$f":"IFERROR(VLOOKUP(INDIRECT($A$5&ROW($A1601)),'State Lookup'!$A:$B,2,FALSE),\"\")","v":""}]
[null,"",{"$f":"IFERROR(VLOOKUP(INDIRECT($A$5&ROW($A1602)),'State Lookup'!$A:$B,2,FALSE),\"\")","v":""}]
[null,{"$f":"IFERROR((INDIRECT($A$3&ROW($A1603))/INDIRECT($A$1&ROW($A1603)))*100,\"\")","v":""},{"$f":"IFERROR(VLOOKUP(INDIRECT($A$5&ROW($A1603)),'State Lookup'!$A:$B,2,FALSE),\"\")","v":""}]
[null,"",{"$f":"IFERROR(VLOOKUP(INDIRECT($A$5&ROW($A1604)),'State Lookup'!$A:$B,2,FALSE),\"\")","v":""}]
[null,"",{"$f":"IFERROR(VLOOKUP(INDIRECT($A$5&ROW($A1605)),'State Lookup'!$A:$B,2,FALSE),\"\")","v":""}]
[null,"",{"$f":"IFERROR(VLOOKUP(INDIRECT($A$5&ROW($A1606)),'State Lookup'!$A:$B,2,FALSE),\"\")","v":""}]
[null,"",{"$f":"IFERROR(VLOOKUP(INDIRECT($A$5&ROW($A1607)),'State Lookup'!$A:$B,2,FALSE),\"\")","v":""}]
[null,"",{"$f":"IFERROR(VLOOKUP(INDIRECT($A$5&ROW($A1608)),'State Lookup'!$A:$B,2,FALSE),\"\")","v":""}]
[null,"",{"$f":"IFERROR(VLOOKUP(INDIRECT($A$5&ROW($A1609)),'State Lookup'!$A:$B,2,FALSE),\"\")","v":""}]
[null,"",{"$f":"IFERROR(VLOOKUP(INDIRECT($A$5&ROW($A1610)),'State Lookup'!$A:$B,2,FALSE),\"\")","v":""}]
[null,"",{"$f":"IFERROR(VLOOKUP(INDIRECT($A$5&ROW($A1611)),'State Lookup'!$A:$B,2,FALSE),\"\")","v":""}]
[null,"",{"$f":"IFERROR(VLOOKUP(INDIRECT($A$5&ROW($A1612)),'State Lookup'!$A:$B,2,FALSE),\"\")","v":""}]
[null,"",{"$f":"IFERROR(VLOOKUP(INDIRECT($A$5&ROW($A1613)),'State Lookup'!$A:$B,2,FALSE),\"\")","v":""}]
[null,"",{"$f":"IFERROR(VLOOKUP(INDIRECT($A$5&ROW($A1614)),'State Lookup'!$A:$B,2,FALSE),\"\")","v":""}]
[null,"",{"$f":"IFERROR(VLOOKUP(INDIRECT($A$5&ROW($A1615)),'State Lookup'!$A:$B,2,FALSE),\"\")","v":""}]
[null,"",{"$f":"IFERROR(VLOOKUP(INDIRECT($A$5&ROW($A1616)),'State Lookup'!$A:$B,2,FALSE),\"\")","v":""}]
[null,"",{"$f":"IFERROR(VLOOKUP(INDIRECT($A$5&ROW($A1617)),'State Lookup'!$A:$B,2,FALSE),\"\")","v":""}]
[null,"",{"$f":"IFERROR(VLOOKUP(INDIRECT($A$5&ROW($A1618)),'State Lookup'!$A:$B,2,FALSE),\"\")","v":""}]
[null,"",{"$f":"IFERROR(VLOOKUP(INDIRECT($A$5&ROW($A1619)),'State Lookup'!$A:$B,2,FALSE),\"\")","v":""}]
[null,"",{"$f":"IFERROR(VLOOKUP(INDIRECT($A$5&ROW($A1620)),'State Lookup'!$A:$B,2,FALSE),\"\")","v":""}]
[null,"",{"$f":"IFERROR(VLOOKUP(INDIRECT($A$5&ROW($A1621)),'State Lookup'!$A:$B,2,FALSE),\"\")","v":""}]
[null,"",{"$f":"IFERROR(VLOOKUP(INDIRECT($A$5&ROW($A1622)),'State Lookup'!$A:$B,2,FALSE),\"\")","v":""}]
[null,"",{"$f":"IFERROR(VLOOKUP(INDIRECT($A$5&ROW($A1623)),'State Lookup'!$A:$B,2,FALSE),\"\")","v":""}]
[null,"",{"$f":"IFERROR(VLOOKUP(INDIRECT($A$5&ROW($A1624)),'State Lookup'!$A:$B,2,FALSE),\"\")","v":""}]
[null,"",{"$f":"IFERROR(VLOOKUP(INDIRECT($A$5&ROW($A1625)),'State Lookup'!$A:$B,2,FALSE),\"\")","v":""}]
[null,"",{"$f":"IFERROR(VLOOKUP(INDIRECT($A$5&ROW($A1626)),'State Lookup'!$A:$B,2,FALSE),\"\")","v":""}]
[null,"",{"$f":"IFERROR(VLOOKUP(INDIRECT($A$5&ROW($A1627)),'State Lookup'!$A:$B,2,FALSE),\"\")","v":""}]
[null,"",{"$f":"IFERROR(VLOOKUP(INDIRECT($A$5&ROW($A1628)),'State Lookup'!$A:$B,2,FALSE),\"\")","v":""}]
[null,"",{"$f":"IFERROR(VLOOKUP(INDIRECT($A$5&ROW($A1629)),'State Lookup'!$A:$B,2,FALSE),\"\")","v":""}]
[null,"",{"$f":"IFERROR(VLOOKUP(INDIRECT($A$5&ROW($A1630)),'State Lookup'!$A:$B,2,FALSE),\"\")","v":""}]
[null,"",{"$f":"IFERROR(VLOOKUP(INDIRECT($A$5&ROW($A1631)),'State Lookup'!$A:$B,2,FALSE),\"\")","v":""}]
[null,"",{"$f":"IFERROR(VLOOKUP(INDIRECT($A$5&ROW($A1632)),'State Lookup'!$A:$B,2,FALSE),\"\")","v":""}]
[null,"",{"$f":"IFERROR(VLOOKUP(INDIRECT($A$5&ROW($A1633)),'State Lookup'!$A:$B,2,FALSE),\"\")","v":""}]
[null,"",{"$f":"IFERROR(VLOOKUP(INDIRECT($A$5&ROW($A1634)),'State Lookup'!$A:$B,2,FALSE),\"\")","v":""}]
[null,"",{"$f":"IFERROR(VLOOKUP(INDIRECT($A$5&ROW($A1635)),'State Lookup'!$A:$B,2,FALSE),\"\")","v":""}]
[null,"",{"$f":"IFERROR(VLOOKUP(INDIRECT($A$5&ROW($A1636)),'State Lookup'!$A:$B,2,FALSE),\"\")","v":""}]
[null,"",{"$f":"IFERROR(VLOOKUP(INDIRECT($A$5&ROW($A1637)),'State Lookup'!$A:$B,2,FALSE),\"\")","v":""}]
[null,"",{"$f":"IFERROR(VLOOKUP(INDIRECT($A$5&ROW($A1638)),'State Lookup'!$A:$B,2,FALSE),\"\")","v":""}]
[null,"",{"$f":"IFERROR(VLOOKUP(INDIRECT($A$5&ROW($A1639)),'State Lookup'!$A:$B,2,FALSE),\"\")","v":""}]
[null,"",{"$f":"IFERROR(VLOOKUP(INDIRECT($A$5&ROW($A1640)),'State Lookup'!$A:$B,2,FALSE),\"\")","v":""}]
[null,"",{"$f":"IFERROR(VLOOKUP(INDIRECT($A$5&ROW($A1641)),'State Lookup'!$A:$B,2,FALSE),\"\")","v":""}]
[null,"",{"$f":"IFERROR(VLOOKUP(INDIRECT($A$5&ROW($A1642)),'State Lookup'!$A:$B,2,FALSE),\"\")","v":""}]
[null,"",{"$f":"IFERROR(VLOOKUP(INDIRECT($A$5&ROW($A1643)),'State Lookup'!$A:$B,2,FALSE),\"\")","v":""}]
[null,"",{"$f":"IFERROR(VLOOKUP(INDIRECT($A$5&ROW($A1644)),'State Lookup'!$A:$B,2,FALSE),\"\")","v":""}]
[null,"",{"$f":"IFERROR(VLOOKUP(INDIRECT($A$5&ROW($A1645)),'State Lookup'!$A:$B,2,FALSE),\"\")","v":""}]
[null,"",{"$f":"IFERROR(VLOOKUP(INDIRECT($A$5&ROW($A1646)),'State Lookup'!$A:$B,2,FALSE),\"\")","v":""}]
[null,"",{"$f":"IFERROR(VLOOKUP(INDIRECT($A$5&ROW($A1647)),'State Lookup'!$A:$B,2,FALSE),\"\")","v":""}]
[null,"",{"$f":"IFERROR(VLOOKUP(INDIRECT($A$5&ROW($A1648)),'State Lookup'!$A:$B,2,FALSE),\"\")","v":""}]
[null,"",{"$f":"IFERROR(VLOOKUP(INDIRECT($A$5&ROW($A1649)),'State Lookup'!$A:$B,2,FALSE),\"\")","v":""}]
[null,"",{"$f":"IFERROR(VLOOKUP(INDIRECT($A$5&ROW($A1650)),'State Lookup'!$A:$B,2,FALSE),\"\")","v":""}]
[null,"",{"$f":"IFERROR(VLOOKUP(INDIRECT($A$5&ROW($A1651)),'State Lookup'!$A:$B,2,FALSE),\"\")","v":""}]
[null,"",{"$f":"IFERROR(VLOOKUP(INDIRECT($A$5&ROW($A1652)),'State Lookup'!$A:$B,2,FALSE),\"\")","v":""}]
[null,"",{"$f":"IFERROR(VLOOKUP(INDIRECT($A$5&ROW($A1653)),'State Lookup'!$A:$B,2,FALSE),\"\")","v":""}]
[null,"",{"$f":"IFERROR(VLOOKUP(INDIRECT($A$5&ROW($A1654)),'State Lookup'!$A:$B,2,FALSE),\"\")","v":""}]
[null,"",{"$f":"IFERROR(VLOOKUP(INDIRECT($A$5&ROW($A1655)),'State Lookup'!$A:$B,2,FALSE),\"\")","v":""}]
[null,"",{"$f":"IFERROR(VLOOKUP(INDIRECT($A$5&ROW($A1656)),'State Lookup'!$A:$B,2,FALSE),\"\")","v":""}]
[null,"",{"$f":"IFERROR(VLOOKUP(INDIRECT($A$5&ROW($A1657)),'State Lookup'!$A:$B,2,FALSE),\"\")","v":""}]
[null,"",{"$f":"IFERROR(VLOOKUP(INDIRECT($A$5&ROW($A1658)),'State Lookup'!$A:$B,2,FALSE),\"\")","v":""}]
[null,"",{"$f":"IFERROR(VLOOKUP(INDIRECT($A$5&ROW($A1659)),'State Lookup'!$A:$B,2,FALSE),\"\")","v":""}]
[null,"",{"$f":"IFERROR(VLOOKUP(INDIRECT($A$5&ROW($A1660)),'State Lookup'!$A:$B,2,FALSE),\"\")","v":""}]
[null,"",{"$f":"IFERROR(VLOOKUP(INDIRECT($A$5&ROW($A1661)),'State Lookup'!$A:$B,2,FALSE),\"\")","v":""}]
[null,"",{"$f":"IFERROR(VLOOKUP(INDIRECT($A$5&ROW($A1662)),'State Lookup'!$A:$B,2,FALSE),\"\")","v":""}]
[null,"",{"$f":"IFERROR(VLOOKUP(INDIRECT($A$5&ROW($A1663)),'State Lookup'!$A:$B,2,FALSE),\"\")","v":""}]
[null,"",{"$f":"IFERROR(VLOOKUP(INDIRECT($A$5&ROW($A1664)),'State Lookup'!$A:$B,2,FALSE),\"\")","v":""}]
[null,"",{"$f":"IFERROR(VLOOKUP(INDIRECT($A$5&ROW($A1665)),'State Lookup'!$A:$B,2,FALSE),\"\")","v":""}]
[null,"",{"$f":"IFERROR(VLOOKUP(INDIRECT($A$5&ROW($A1666)),'State Lookup'!$A:$B,2,FALSE),\"\")","v":""}]
[null,{"$f":"IFERROR((INDIRECT($A$3&ROW($A1667))/INDIRECT($A$1&ROW($A1667)))*100,\"\")","v":""},{"$f":"IFERROR(VLOOKUP(INDIRECT($A$5&ROW($A1667)),'State Lookup'!$A:$B,2,FALSE),\"\")","v":""}]
[null,"",{"$f":"IFERROR(VLOOKUP(INDIRECT($A$5&ROW($A1668)),'State Lookup'!$A:$B,2,FALSE),\"\")","v":""}]
[null,"",{"$f":"IFERROR(VLOOKUP(INDIRECT($A$5&ROW($A1669)),'State Lookup'!$A:$B,2,FALSE),\"\")","v":""}]
[null,"",{"$f":"IFERROR(VLOOKUP(INDIRECT($A$5&ROW($A1670)),'State Lookup'!$A:$B,2,FALSE),\"\")","v":""}]
[null,"",{"$f":"IFERROR(VLOOKUP(INDIRECT($A$5&ROW($A1671)),'State Lookup'!$A:$B,2,FALSE),\"\")","v":""}]
[null,"",{"$f":"IFERROR(VLOOKUP(INDIRECT($A$5&ROW($A1672)),'State Lookup'!$A:$B,2,FALSE),\"\")","v":""}]
[null,"",{"$f":"IFERROR(VLOOKUP(INDIRECT($A$5&ROW($A1673)),'State Lookup'!$A:$B,2,FALSE),\"\")","v":""}]
[null,"",{"$f":"IFERROR(VLOOKUP(INDIRECT($A$5&ROW($A1674)),'State Lookup'!$A:$B,2,FALSE),\"\")","v":""}]
[null,"",{"$f":"IFERROR(VLOOKUP(INDIRECT($A$5&ROW($A1675)),'State Lookup'!$A:$B,2,FALSE),\"\")","v":""}]
[null,"",{"$f":"IFERROR(VLOOKUP(INDIRECT($A$5&ROW($A1676)),'State Lookup'!$A:$B,2,FALSE),\"\")","v":""}]
[null,"",{"$f":"IFERROR(VLOOKUP(INDIRECT($A$5&ROW($A1677)),'State Lookup'!$A:$B,2,FALSE),\"\")","v":""}]
[null,"",{"$f":"IFERROR(VLOOKUP(INDIRECT($A$5&ROW($A1678)),'State Lookup'!$A:$B,2,FALSE),\"\")","v":""}]
[null,"",{"$f":"IFERROR(VLOOKUP(INDIRECT($A$5&ROW($A1679)),'State Lookup'!$A:$B,2,FALSE),\"\")","v":""}]
[null,"",{"$f":"IFERROR(VLOOKUP(INDIRECT($A$5&ROW($A1680)),'State Lookup'!$A:$B,2,FALSE),\"\")","v":""}]
[null,"",{"$f":"IFERROR(VLOOKUP(INDIRECT($A$5&ROW($A1681)),'State Lookup'!$A:$B,2,FALSE),\"\")","v":""}]
[null,"",{"$f":"IFERROR(VLOOKUP(INDIRECT($A$5&ROW($A1682)),'State Lookup'!$A:$B,2,FALSE),\"\")","v":""}]
[null,"",{"$f":"IFERROR(VLOOKUP(INDIRECT($A$5&ROW($A1683)),'State Lookup'!$A:$B,2,FALSE),\"\")","v":""}]
[null,"",{"$f":"IFERROR(VLOOKUP(INDIRECT($A$5&ROW($A1684)),'State Lookup'!$A:$B,2,FALSE),\"\")","v":""}]
[null,"",{"$f":"IFERROR(VLOOKUP(INDIRECT($A$5&ROW($A1685)),'State Lookup'!$A:$B,2,FALSE),\"\")","v":""}]
[null,"",{"$f":"IFERROR(VLOOKUP(INDIRECT($A$5&ROW($A1686)),'State Lookup'!$A:$B,2,FALSE),\"\")","v":""}]
[null,"",{"$f":"IFERROR(VLOOKUP(INDIRECT($A$5&ROW($A1687)),'State Lookup'!$A:$B,2,FALSE),\"\")","v":""}]
[null,"",{"$f":"IFERROR(VLOOKUP(INDIRECT($A$5&ROW($A1688)),'State Lookup'!$A:$B,2,FALSE),\"\")","v":""}]
[null,"",{"$f":"IFERROR(VLOOKUP(INDIRECT($A$5&ROW($A1689)),'State Lookup'!$A:$B,2,FALSE),\"\")","v":""}]
[null,"",{"$f":"IFERROR(VLOOKUP(INDIRECT($A$5&ROW($A1690)),'State Lookup'!$A:$B,2,FALSE),\"\")","v":""}]
[null,"",{"$f":"IFERROR(VLOOKUP(INDIRECT($A$5&ROW($A1691)),'State Lookup'!$A:$B,2,FALSE),\"\")","v":""}]
[null,"",{"$f":"IFERROR(VLOOKUP(INDIRECT($A$5&ROW($A1692)),'State Lookup'!$A:$B,2,FALSE),\"\")","v":""}]
[null,"",{"$f":"IFERROR(VLOOKUP(INDIRECT($A$5&ROW($A1693)),'State Lookup'!$A:$B,2,FALSE),\"\")","v":""}]
[null,"",{"$f":"IFERROR(VLOOKUP(INDIRECT($A$5&ROW($A1694)),'State Lookup'!$A:$B,2,FALSE),\"\")","v":""}]
[null,"",{"$f":"IFERROR(VLOOKUP(INDIRECT($A$5&ROW($A1695)),'State Lookup'!$A:$B,2,FALSE),\"\")","v":""}]
[null,"",{"$f":"IFERROR(VLOOKUP(INDIRECT($A$5&ROW($A1696)),'State Lookup'!$A:$B,2,FALSE),\"\")","v":""}]
[null,"",{"$f":"IFERROR(VLOOKUP(INDIRECT($A$5&ROW($A1697)),'State Lookup'!$A:$B,2,FALSE),\"\")","v":""}]
[null,"",{"$f":"IFERROR(VLOOKUP(INDIRECT($A$5&ROW($A1698)),'State Lookup'!$A:$B,2,FALSE),\"\")","v":""}]
[null,"",{"$f":"IFERROR(VLOOKUP(INDIRECT($A$5&ROW($A1699)),'State Lookup'!$A:$B,2,FALSE),\"\")","v":""}]
[null,"",{"$f":"IFERROR(VLOOKUP(INDIRECT($A$5&ROW($A1700)),'State Lookup'!$A:$B,2,FALSE),\"\")","v":""}]
[null,"",{"$f":"IFERROR(VLOOKUP(INDIRECT($A$5&ROW($A1701)),'State Lookup'!$A:$B,2,FALSE),\"\")","v":""}]
[null,"",{"$f":"IFERROR(VLOOKUP(INDIRECT($A$5&ROW($A1702)),'State Lookup'!$A:$B,2,FALSE),\"\")","v":""}]
[null,"",{"$f":"IFERROR(VLOOKUP(INDIRECT($A$5&ROW($A1703)),'State Lookup'!$A:$B,2,FALSE),\"\")","v":""}]
[null,"",{"$f":"IFERROR(VLOOKUP(INDIRECT($A$5&ROW($A1704)),'State Lookup'!$A:$B,2,FALSE),\"\")","v":""}]
[null,"",{"$f":"IFERROR(VLOOKUP(INDIRECT($A$5&ROW($A1705)),'State Lookup'!$A:$B,2,FALSE),\"\")","v":""}]
[null,"",{"$f":"IFERROR(VLOOKUP(INDIRECT($A$5&ROW($A1706)),'State Lookup'!$A:$B,2,FALSE),\"\")","v":""}]
[null,"",{"$f":"IFERROR(VLOOKUP(INDIRECT($A$5&ROW($A1707)),'State Lookup'!$A:$B,2,FALSE),\"\")","v":""}]
[null,"",{"$f":"IFERROR(VLOOKUP(INDIRECT($A$5&ROW($A1708)),'State Lookup'!$A:$B,2,FALSE),\"\")","v":""}]
[null,"",{"$f":"IFERROR(VLOOKUP(INDIRECT($A$5&ROW($A1709)),'State Lookup'!$A:$B,2,FALSE),\"\")","v":""}]
[null,"",{"$f":"IFERROR(VLOOKUP(INDIRECT($A$5&ROW($A1710)),'State Lookup'!$A:$B,2,FALSE),\"\")","v":""}]
[null,"",{"$f":"IFERROR(VLOOKUP(INDIRECT($A$5&ROW($A1711)),'State Lookup'!$A:$B,2,FALSE),\"\")","v":""}]
[null,"",{"$f":"IFERROR(VLOOKUP(INDIRECT($A$5&ROW($A1712)),'State Lookup'!$A:$B,2,FALSE),\"\")","v":""}]
[null,"",{"$f":"IFERROR(VLOOKUP(INDIRECT($A$5&ROW($A1713)),'State Lookup'!$A:$B,2,FALSE),\"\")","v":""}]
[null,"",{"$f":"IFERROR(VLOOKUP(INDIRECT($A$5&ROW($A1714)),'State Lookup'!$A:$B,2,FALSE),\"\")","v":""}]
[null,"",{"$f":"IFERROR(VLOOKUP(INDIRECT($A$5&ROW($A1715)),'State Lookup'!$A:$B,2,FALSE),\"\")","v":""}]
[null,"",{"$f":"IFERROR(VLOOKUP(INDIRECT($A$5&ROW($A1716)),'State Lookup'!$A:$B,2,FALSE),\"\")","v":""}]
[null,"",{"$f":"IFERROR(VLOOKUP(INDIRECT($A$5&ROW($A1717)),'State Lookup'!$A:$B,2,FALSE),\"\")","v":""}]
[null,"",{"$f":"IFERROR(VLOOKUP(INDIRECT($A$5&ROW($A1718)),'State Lookup'!$A:$B,2,FALSE),\"\")","v":""}]
[null,"",{"$f":"IFERROR(VLOOKUP(INDIRECT($A$5&ROW($A1719)),'State Lookup'!$A:$B,2,FALSE),\"\")","v":""}]
[null,"",{"$f":"IFERROR(VLOOKUP(INDIRECT($A$5&ROW($A1720)),'State Lookup'!$A:$B,2,FALSE),\"\")","v":""}]
[null,"",{"$f":"IFERROR(VLOOKUP(INDIRECT($A$5&ROW($A1721)),'State Lookup'!$A:$B,2,FALSE),\"\")","v":""}]
[null,"",{"$f":"IFERROR(VLOOKUP(INDIRECT($A$5&ROW($A1722)),'State Lookup'!$A:$B,2,FALSE),\"\")","v":""}]
[null,"",{"$f":"IFERROR(VLOOKUP(INDIRECT($A$5&ROW($A1723)),'State Lookup'!$A:$B,2,FALSE),\"\")","v":""}]
[null,"",{"$f":"IFERROR(VLOOKUP(INDIRECT($A$5&ROW($A1724)),'State Lookup'!$A:$B,2,FALSE),\"\")","v":""}]
[null,"",{"$f":"IFERROR(VLOOKUP(INDIRECT($A$5&ROW($A1725)),'State Lookup'!$A:$B,2,FALSE),\"\")","v":""}]
[null,"",{"$f":"IFERROR(VLOOKUP(INDIRECT($A$5&ROW($A1726)),'State Lookup'!$A:$B,2,FALSE),\"\")","v":""}]
[null,"",{"$f":"IFERROR(VLOOKUP(INDIRECT($A$5&ROW($A1727)),'State Lookup'!$A:$B,2,FALSE),\"\")","v":""}]
[null,"",{"$f":"IFERROR(VLOOKUP(INDIRECT($A$5&ROW($A1728)),'State Lookup'!$A:$B,2,FALSE),\"\")","v":""}]
[null,"",{"$f":"IFERROR(VLOOKUP(INDIRECT($A$5&ROW($A1729)),'State Lookup'!$A:$B,2,FALSE),\"\")","v":""}]
[null,"",{"$f":"IFERROR(VLOOKUP(INDIRECT($A$5&ROW($A1730)),'State Lookup'!$A:$B,2,FALSE),\"\")","v":""}]
[null,{"$f":"IFERROR((INDIRECT($A$3&ROW($A1731))/INDIRECT($A$1&ROW($A1731)))*100,\"\")","v":""},{"$f":"IFERROR(VLOOKUP(INDIRECT($A$5&ROW($A1731)),'State Lookup'!$A:$B,2,FALSE),\"\")","v":""}]
[null,"",{"$f":"IFERROR(VLOOKUP(INDIRECT($A$5&ROW($A1732)),'State Lookup'!$A:$B,2,FALSE),\"\")","v":""}]
[null,"",{"$f":"IFERROR(VLOOKUP(INDIRECT($A$5&ROW($A1733)),'State Lookup'!$A:$B,2,FALSE),\"\")","v":""}]
[null,"",{"$f":"IFERROR(VLOOKUP(INDIRECT($A$5&ROW($A1734)),'State Lookup'!$A:$B,2,FALSE),\"\")","v":""}]
[null,"",{"$f":"IFERROR(VLOOKUP(INDIRECT($A$5&ROW($A1735)),'State Lookup'!$A:$B,2,FALSE),\"\")","v":""}]
[null,"",{"$f":"IFERROR(VLOOKUP(INDIRECT($A$5&ROW($A1736)),'State Lookup'!$A:$B,2,FALSE),\"\")","v":""}]
[null,"",{"$f":"IFERROR(VLOOKUP(INDIRECT($A$5&ROW($A1737)),'State Lookup'!$A:$B,2,FALSE),\"\")","v":""}]
[null,"",{"$f":"IFERROR(VLOOKUP(INDIRECT($A$5&ROW($A1738)),'State Lookup'!$A:$B,2,FALSE),\"\")","v":""}]
[null,"",{"$f":"IFERROR(VLOOKUP(INDIRECT($A$5&ROW($A1739)),'State Lookup'!$A:$B,2,FALSE),\"\")","v":""}]
[null,"",{"$f":"IFERROR(VLOOKUP(INDIRECT($A$5&ROW($A1740)),'State Lookup'!$A:$B,2,FALSE),\"\")","v":""}]
[null,"",{"$f":"IFERROR(VLOOKUP(INDIRECT($A$5&ROW($A1741)),'State Lookup'!$A:$B,2,FALSE),\"\")","v":""}]
[null,"",{"$f":"IFERROR(VLOOKUP(INDIRECT($A$5&ROW($A1742)),'State Lookup'!$A:$B,2,FALSE),\"\")","v":""}]
[null,"",{"$f":"IFERROR(VLOOKUP(INDIRECT($A$5&ROW($A1743)),'State Lookup'!$A:$B,2,FALSE),\"\")","v":""}]
[null,"",{"$f":"IFERROR(VLOOKUP(INDIRECT($A$5&ROW($A1744)),'State Lookup'!$A:$B,2,FALSE),\"\")","v":""}]
[null,"",{"$f":"IFERROR(VLOOKUP(INDIRECT($A$5&ROW($A1745)),'State Lookup'!$A:$B,2,FALSE),\"\")","v":""}]
[null,"",{"$f":"IFERROR(VLOOKUP(INDIRECT($A$5&ROW($A1746)),'State Lookup'!$A:$B,2,FALSE),\"\")","v":""}]
[null,"",{"$f":"IFERROR(VLOOKUP(INDIRECT($A$5&ROW($A1747)),'State Lookup'!$A:$B,2,FALSE),\"\")","v":""}]
[null,"",{"$f":"IFERROR(VLOOKUP(INDIRECT($A$5&ROW($A1748)),'State Lookup'!$A:$B,2,FALSE),\"\")","v":""}]
[null,"",{"$f":"IFERROR(VLOOKUP(INDIRECT($A$5&ROW($A1749)),'State Lookup'!$A:$B,2,FALSE),\"\")","v":""}]
[null,"",{"$f":"IFERROR(VLOOKUP(INDIRECT($A$5&ROW($A1750)),'State Lookup'!$A:$B,2,FALSE),\"\")","v":""}]
[null,"",{"$f":"IFERROR(VLOOKUP(INDIRECT($A$5&ROW($A1751)),'State Lookup'!$A:$B,2,FALSE),\"\")","v":""}]
[null,"",{"$f":"IFERROR(VLOOKUP(INDIRECT($A$5&ROW($A1752)),'State Lookup'!$A:$B,2,FALSE),\"\")","v":""}]
[null,"",{"$f":"IFERROR(VLOOKUP(INDIRECT($A$5&ROW($A1753)),'State Lookup'!$A:$B,2,FALSE),\"\")","v":""}]
[null,"",{"$f":"IFERROR(VLOOKUP(INDIRECT($A$5&ROW($A1754)),'State Lookup'!$A:$B,2,FALSE),\"\")","v":""}]
[null,"",{"$f":"IFERROR(VLOOKUP(INDIRECT($A$5&ROW($A1755)),'State Lookup'!$A:$B,2,FALSE),\"\")","v":""}]
[null,"",{"$f":"IFERROR(VLOOKUP(INDIRECT($A$5&ROW($A1756)),'State Lookup'!$A:$B,2,FALSE),\"\")","v":""}]
[null,"",{"$f":"IFERROR(VLOOKUP(INDIRECT($A$5&ROW($A1757)),'State Lookup'!$A:$B,2,FALSE),\"\")","v":""}]
[null,"",{"$f":"IFERROR(VLOOKUP(INDIRECT($A$5&ROW($A1758)),'State Lookup'!$A:$B,2,FALSE),\"\")","v":""}]
[null,"",{"$f":"IFERROR(VLOOKUP(INDIRECT($A$5&ROW($A1759)),'State Lookup'!$A:$B,2,FALSE),\"\")","v":""}]
[null,"",{"$f":"IFERROR(VLOOKUP(INDIRECT($A$5&ROW($A1760)),'State Lookup'!$A:$B,2,FALSE),\"\")","v":""}]
[null,"",{"$f":"IFERROR(VLOOKUP(INDIRECT($A$5&ROW($A1761)),'State Lookup'!$A:$B,2,FALSE),\"\")","v":""}]
[null,"",{"$f":"IFERROR(VLOOKUP(INDIRECT($A$5&ROW($A1762)),'State Lookup'!$A:$B,2,FALSE),\"\")","v":""}]
[null,"",{"$f":"IFERROR(VLOOKUP(INDIRECT($A$5&ROW($A1763)),'State Lookup'!$A:$B,2,FALSE),\"\")","v":""}]
[null,"",{"$f":"IFERROR(VLOOKUP(INDIRECT($A$5&ROW($A1764)),'State Lookup'!$A:$B,2,FALSE),\"\")","v":""}]
[null,"",{"$f":"IFERROR(VLOOKUP(INDIRECT($A$5&ROW($A1765)),'State Lookup'!$A:$B,2,FALSE),\"\")","v":""}]
[null,"",{"$f":"IFERROR(VLOOKUP(INDIRECT($A$5&ROW($A1766)),'State Lookup'!$A:$B,2,FALSE),\"\")","v":""}]
[null,"",{"$f":"IFERROR(VLOOKUP(INDIRECT($A$5&ROW($A1767)),'State Lookup'!$A:$B,2,FALSE),\"\")","v":""}]
[null,"",{"$f":"IFERROR(VLOOKUP(INDIRECT($A$5&ROW($A1768)),'State Lookup'!$A:$B,2,FALSE),\"\")","v":""}]
[null,"",{"$f":"IFERROR(VLOOKUP(INDIRECT($A$5&ROW($A1769)),'State Lookup'!$A:$B,2,FALSE),\"\")","v":""}]
[null,"",{"$f":"IFERROR(VLOOKUP(INDIRECT($A$5&ROW($A1770)),'State Lookup'!$A:$B,2,FALSE),\"\")","v":""}]
[null,"",{"$f":"IFERROR(VLOOKUP(INDIRECT($A$5&ROW($A1771)),'State Lookup'!$A:$B,2,FALSE),\"\")","v":""}]
[null,"",{"$f":"IFERROR(VLOOKUP(INDIRECT($A$5&ROW($A1772)),'State Lookup'!$A:$B,2,FALSE),\"\")","v":""}]
[null,"",{"$f":"IFERROR(VLOOKUP(INDIRECT($A$5&ROW($A1773)),'State Lookup'!$A:$B,2,FALSE),\"\")","v":""}]
[null,"",{"$f":"IFERROR(VLOOKUP(INDIRECT($A$5&ROW($A1774)),'State Lookup'!$A:$B,2,FALSE),\"\")","v":""}]
[null,"",{"$f":"IFERROR(VLOOKUP(INDIRECT($A$5&ROW($A1775)),'State Lookup'!$A:$B,2,FALSE),\"\")","v":""}]
[null,"",{"$f":"IFERROR(VLOOKUP(INDIRECT($A$5&ROW($A1776)),'State Lookup'!$A:$B,2,FALSE),\"\")","v":""}]
[null,"",{"$f":"IFERROR(VLOOKUP(INDIRECT($A$5&ROW($A1777)),'State Lookup'!$A:$B,2,FALSE),\"\")","v":""}]
[null,"",{"$f":"IFERROR(VLOOKUP(INDIRECT($A$5&ROW($A1778)),'State Lookup'!$A:$B,2,FALSE),\"\")","v":""}]
[null,"",{"$f":"IFERROR(VLOOKUP(INDIRECT($A$5&ROW($A1779)),'State Lookup'!$A:$B,2,FALSE),\"\")","v":""}]
[null,"",{"$f":"IFERROR(VLOOKUP(INDIRECT($A$5&ROW($A1780)),'State Lookup'!$A:$B,2,FALSE),\"\")","v":""}]
[null,"",{"$f":"IFERROR(VLOOKUP(INDIRECT($A$5&ROW($A1781)),'State Lookup'!$A:$B,2,FALSE),\"\")","v":""}]
[null,"",{"$f":"IFERROR(VLOOKUP(INDIRECT($A$5&ROW($A1782)),'State Lookup'!$A:$B,2,FALSE),\"\")","v":""}]
[null,"",{"$f":"IFERROR(VLOOKUP(INDIRECT($A$5&ROW($A1783)),'State Lookup'!$A:$B,2,FALSE),\"\")","v":""}]
[null,"",{"$f":"IFERROR(VLOOKUP(INDIRECT($A$5&ROW($A1784)),'State Lookup'!$A:$B,2,FALSE),\"\")","v":""}]
[null,"",{"$f":"IFERROR(VLOOKUP(INDIRECT($A$5&ROW($A1785)),'State Lookup'!$A:$B,2,FALSE),\"\")","v":""}]
[null,"",{"$f":"IFERROR(VLOOKUP(INDIRECT($A$5&ROW($A1786)),'State Lookup'!$A:$B,2,FALSE),\"\")","v":""}]
[null,"",{"$f":"IFERROR(VLOOKUP(INDIRECT($A$5&ROW($A1787)),'State Lookup'!$A:$B,2,FALSE),\"\")","v":""}]
[null,"",{"$f":"IFERROR(VLOOKUP(INDIRECT($A$5&ROW($A1788)),'State Lookup'!$A:$B,2,FALSE),\"\")","v":""}]
[null,"",{"$f":"IFERROR(VLOOKUP(INDIRECT($A$5&ROW($A1789)),'State Lookup'!$A:$B,2,FALSE),\"\")","v":""}]
[null,"",{"$f":"IFERROR(VLOOKUP(INDIRECT($A$5&ROW($A1790)),'State Lookup'!$A:$B,2,FALSE),\"\")","v":""}]
[null,"",{"$f":"IFERROR(VLOOKUP(INDIRECT($A$5&ROW($A1791)),'State Lookup'!$A:$B,2,FALSE),\"\")","v":""}]
[null,"",{"$f":"IFERROR(VLOOKUP(INDIRECT($A$5&ROW($A1792)),'State Lookup'!$A:$B,2,FALSE),\"\")","v":""}]
[null,"",{"$f":"IFERROR(VLOOKUP(INDIRECT($A$5&ROW($A1793)),'State Lookup'!$A:$B,2,FALSE),\"\")","v":""}]
[null,"",{"$f":"IFERROR(VLOOKUP(INDIRECT($A$5&ROW($A1794)),'State Lookup'!$A:$B,2,FALSE),\"\")","v":""}]
[null,{"$f":"IFERROR((INDIRECT($A$3&ROW($A1795))/INDIRECT($A$1&ROW($A1795)))*100,\"\")","v":""},{"$f":"IFERROR(VLOOKUP(INDIRECT($A$5&ROW($A1795)),'State Lookup'!$A:$B,2,FALSE),\"\")","v":""}]
[null,"",{"$f":"IFERROR(VLOOKUP(INDIRECT($A$5&ROW($A1796)),'State Lookup'!$A:$B,2,FALSE),\"\")","v":""}]
[null,"",{"$f":"IFERROR(VLOOKUP(INDIRECT($A$5&ROW($A1797)),'State Lookup'!$A:$B,2,FALSE),\"\")","v":""}]
[null,"",{"$f":"IFERROR(VLOOKUP(INDIRECT($A$5&ROW($A1798)),'State Lookup'!$A:$B,2,FALSE),\"\")","v":""}]
[null,"",{"$f":"IFERROR(VLOOKUP(INDIRECT($A$5&ROW($A1799)),'State Lookup'!$A:$B,2,FALSE),\"\")","v":""}]
[null,"",{"$f":"IFERROR(VLOOKUP(INDIRECT($A$5&ROW($A1800)),'State Lookup'!$A:$B,2,FALSE),\"\")","v":""}]
[null,"",{"$f":"IFERROR(VLOOKUP(INDIRECT($A$5&ROW($A1801)),'State Lookup'!$A:$B,2,FALSE),\"\")","v":""}]
[null,"",{"$f":"IFERROR(VLOOKUP(INDIRECT($A$5&ROW($A1802)),'State Lookup'!$A:$B,2,FALSE),\"\")","v":""}]
[null,"",{"$f":"IFERROR(VLOOKUP(INDIRECT($A$5&ROW($A1803)),'State Lookup'!$A:$B,2,FALSE),\"\")","v":""}]
[null,"",{"$f":"IFERROR(VLOOKUP(INDIRECT($A$5&ROW($A1804)),'State Lookup'!$A:$B,2,FALSE),\"\")","v":""}]
[null,"",{"$f":"IFERROR(VLOOKUP(INDIRECT($A$5&ROW($A1805)),'State Lookup'!$A:$B,2,FALSE),\"\")","v":""}]
[null,"",{"$f":"IFERROR(VLOOKUP(INDIRECT($A$5&ROW($A1806)),'State Lookup'!$A:$B,2,FALSE),\"\")","v":""}]
[null,"",{"$f":"IFERROR(VLOOKUP(INDIRECT($A$5&ROW($A1807)),'State Lookup'!$A:$B,2,FALSE),\"\")","v":""}]
[null,"",{"$f":"IFERROR(VLOOKUP(INDIRECT($A$5&ROW($A1808)),'State Lookup'!$A:$B,2,FALSE),\"\")","v":""}]
[null,"",{"$f":"IFERROR(VLOOKUP(INDIRECT($A$5&ROW($A1809)),'State Lookup'!$A:$B,2,FALSE),\"\")","v":""}]
[null,"",{"$f":"IFERROR(VLOOKUP(INDIRECT($A$5&ROW($A1810)),'State Lookup'!$A:$B,2,FALSE),\"\")","v":""}]
[null,"",{"$f":"IFERROR(VLOOKUP(INDIRECT($A$5&ROW($A1811)),'State Lookup'!$A:$B,2,FALSE),\"\")","v":""}]
[null,"",{"$f":"IFERROR(VLOOKUP(INDIRECT($A$5&ROW($A1812)),'State Lookup'!$A:$B,2,FALSE),\"\")","v":""}]
[null,"",{"$f":"IFERROR(VLOOKUP(INDIRECT($A$5&ROW($A1813)),'State Lookup'!$A:$B,2,FALSE),\"\")","v":""}]
[null,"",{"$f":"IFERROR(VLOOKUP(INDIRECT($A$5&ROW($A1814)),'State Lookup'!$A:$B,2,FALSE),\"\")","v":""}]
[null,"",{"$f":"IFERROR(VLOOKUP(INDIRECT($A$5&ROW($A1815)),'State Lookup'!$A:$B,2,FALSE),\"\")","v":""}]
[null,"",{"$f":"IFERROR(VLOOKUP(INDIRECT($A$5&ROW($A1816)),'State Lookup'!$A:$B,2,FALSE),\"\")","v":""}]
[null,"",{"$f":"IFERROR(VLOOKUP(INDIRECT($A$5&ROW($A1817)),'State Lookup'!$A:$B,2,FALSE),\"\")","v":""}]
[null,"",{"$f":"IFERROR(VLOOKUP(INDIRECT($A$5&ROW($A1818)),'State Lookup'!$A:$B,2,FALSE),\"\")","v":""}]
[null,"",{"$f":"IFERROR(VLOOKUP(INDIRECT($A$5&ROW($A1819)),'State Lookup'!$A:$B,2,FALSE),\"\")","v":""}]
[null,"",{"$f":"IFERROR(VLOOKUP(INDIRECT($A$5&ROW($A1820)),'State Lookup'!$A:$B,2,FALSE),\"\")","v":""}]
[null,"",{"$f":"IFERROR(VLOOKUP(INDIRECT($A$5&ROW($A1821)),'State Lookup'!$A:$B,2,FALSE),\"\")","v":""}]
[null,"",{"$f":"IFERROR(VLOOKUP(INDIRECT($A$5&ROW($A1822)),'State Lookup'!$A:$B,2,FALSE),\"\")","v":""}]
[null,"",{"$f":"IFERROR(VLOOKUP(INDIRECT($A$5&ROW($A1823)),'State Lookup'!$A:$B,2,FALSE),\"\")","v":""}]
[null,"",{"$f":"IFERROR(VLOOKUP(INDIRECT($A$5&ROW($A1824)),'State Lookup'!$A:$B,2,FALSE),\"\")","v":""}]
[null,"",{"$f":"IFERROR(VLOOKUP(INDIRECT($A$5&ROW($A1825)),'State Lookup'!$A:$B,2,FALSE),\"\")","v":""}]
[null,"",{"$f":"IFERROR(VLOOKUP(INDIRECT($A$5&ROW($A1826)),'State Lookup'!$A:$B,2,FALSE),\"\")","v":""}]
[null,"",{"$f":"IFERROR(VLOOKUP(INDIRECT($A$5&ROW($A1827)),'State Lookup'!$A:$B,2,FALSE),\"\")","v":""}]
[null,"",{"$f":"IFERROR(VLOOKUP(INDIRECT($A$5&ROW($A1828)),'State Lookup'!$A:$B,2,FALSE),\"\")","v":""}]
[null,"",{"$f":"IFERROR(VLOOKUP(INDIRECT($A$5&ROW($A1829)),'State Lookup'!$A:$B,2,FALSE),\"\")","v":""}]
[null,"",{"$f":"IFERROR(VLOOKUP(INDIRECT($A$5&ROW($A1830)),'State Lookup'!$A:$B,2,FALSE),\"\")","v":""}]
[null,"",{"$f":"IFERROR(VLOOKUP(INDIRECT($A$5&ROW($A1831)),'State Lookup'!$A:$B,2,FALSE),\"\")","v":""}]
[null,"",{"$f":"IFERROR(VLOOKUP(INDIRECT($A$5&ROW($A1832)),'State Lookup'!$A:$B,2,FALSE),\"\")","v":""}]
[null,"",{"$f":"IFERROR(VLOOKUP(INDIRECT($A$5&ROW($A1833)),'State Lookup'!$A:$B,2,FALSE),\"\")","v":""}]
[null,"",{"$f":"IFERROR(VLOOKUP(INDIRECT($A$5&ROW($A1834)),'State Lookup'!$A:$B,2,FALSE),\"\")","v":""}]
[null,"",{"$f":"IFERROR(VLOOKUP(INDIRECT($A$5&ROW($A1835)),'State Lookup'!$A:$B,2,FALSE),\"\")","v":""}]
[null,"",{"$f":"IFERROR(VLOOKUP(INDIRECT($A$5&ROW($A1836)),'State Lookup'!$A:$B,2,FALSE),\"\")","v":""}]
[null,"",{"$f":"IFERROR(VLOOKUP(INDIRECT($A$5&ROW($A1837)),'State Lookup'!$A:$B,2,FALSE),\"\")","v":""}]
[null,"",{"$f":"IFERROR(VLOOKUP(INDIRECT($A$5&ROW($A1838)),'State Lookup'!$A:$B,2,FALSE),\"\")","v":""}]
[null,"",{"$f":"IFERROR(VLOOKUP(INDIRECT($A$5&ROW($A1839)),'State Lookup'!$A:$B,2,FALSE),\"\")","v":""}]
[null,"",{"$f":"IFERROR(VLOOKUP(INDIRECT($A$5&ROW($A1840)),'State Lookup'!$A:$B,2,FALSE),\"\")","v":""}]
[null,"",{"$f":"IFERROR(VLOOKUP(INDIRECT($A$5&ROW($A1841)),'State Lookup'!$A:$B,2,FALSE),\"\")","v":""}]
[null,"",{"$f":"IFERROR(VLOOKUP(INDIRECT($A$5&ROW($A1842)),'State Lookup'!$A:$B,2,FALSE),\"\")","v":""}]
[null,"",{"$f":"IFERROR(VLOOKUP(INDIRECT($A$5&ROW($A1843)),'State Lookup'!$A:$B,2,FALSE),\"\")","v":""}]
[null,"",{"$f":"IFERROR(VLOOKUP(INDIRECT($A$5&ROW($A1844)),'State Lookup'!$A:$B,2,FALSE),\"\")","v":""}]
[null,"",{"$f":"IFERROR(VLOOKUP(INDIRECT($A$5&ROW($A1845)),'State Lookup'!$A:$B,2,FALSE),\"\")","v":""}]
[null,"",{"$f":"IFERROR(VLOOKUP(INDIRECT($A$5&ROW($A1846)),'State Lookup'!$A:$B,2,FALSE),\"\")","v":""}]
[null,"",{"$f":"IFERROR(VLOOKUP(INDIRECT($A$5&ROW($A1847)),'State Lookup'!$A:$B,2,FALSE),\"\")","v":""}]
[null,"",{"$f":"IFERROR(VLOOKUP(INDIRECT($A$5&ROW($A1848)),'State Lookup'!$A:$B,2,FALSE),\"\")","v":""}]
[null,"",{"$f":"IFERROR(VLOOKUP(INDIRECT($A$5&ROW($A1849)),'State Lookup'!$A:$B,2,FALSE),\"\")","v":""}]
[null,"",{"$f":"IFERROR(VLOOKUP(INDIRECT($A$5&ROW($A1850)),'State Lookup'!$A:$B,2,FALSE),\"\")","v":""}]
[null,"",{"$f":"IFERROR(VLOOKUP(INDIRECT($A$5&ROW($A1851)),'State Lookup'!$A:$B,2,FALSE),\"\")","v":""}]
[null,"",{"$f":"IFERROR(VLOOKUP(INDIRECT($A$5&ROW($A1852)),'State Lookup'!$A:$B,2,FALSE),\"\")","v":""}]
[null,"",{"$f":"IFERROR(VLOOKUP(INDIRECT($A$5&ROW($A1853)),'State Lookup'!$A:$B,2,FALSE),\"\")","v":""}]
[null,"",{"$f":"IFERROR(VLOOKUP(INDIRECT($A$5&ROW($A1854)),'State Lookup'!$A:$B,2,FALSE),\"\")","v":""}]
[null,"",{"$f":"IFERROR(VLOOKUP(INDIRECT($A$5&ROW($A1855)),'State Lookup'!$A:$B,2,FALSE),\"\")","v":""}]
[null,"",{"$f":"IFERROR(VLOOKUP(INDIRECT($A$5&ROW($A1856)),'State Lookup'!$A:$B,2,FALSE),\"\")","v":""}]
[null,"",{"$f":"IFERROR(VLOOKUP(INDIRECT($A$5&ROW($A1857)),'State Lookup'!$A:$B,2,FALSE),\"\")","v":""}]
[null,"",{"$f":"IFERROR(VLOOKUP(INDIRECT($A$5&ROW($A1858)),'State Lookup'!$A:$B,2,FALSE),\"\")","v":""}]
[null,{"$f":"IFERROR((INDIRECT($A$3&ROW($A1859))/INDIRECT($A$1&ROW($A1859)))*100,\"\")","v":""},{"$f":"IFERROR(VLOOKUP(INDIRECT($A$5&ROW($A1859)),'State Lookup'!$A:$B,2,FALSE),\"\")","v":""}]
[null,"",{"$f":"IFERROR(VLOOKUP(INDIRECT($A$5&ROW($A1860)),'State Lookup'!$A:$B,2,FALSE),\"\")","v":""}]
[null,"",{"$f":"IFERROR(VLOOKUP(INDIRECT($A$5&ROW($A1861)),'State Lookup'!$A:$B,2,FALSE),\"\")","v":""}]
[null,"",{"$f":"IFERROR(VLOOKUP(INDIRECT($A$5&ROW($A1862)),'State Lookup'!$A:$B,2,FALSE),\"\")","v":""}]
[null,"",{"$f":"IFERROR(VLOOKUP(INDIRECT($A$5&ROW($A1863)),'State Lookup'!$A:$B,2,FALSE),\"\")","v":""}]
[null,"",{"$f":"IFERROR(VLOOKUP(INDIRECT($A$5&ROW($A1864)),'State Lookup'!$A:$B,2,FALSE),\"\")","v":""}]
[null,"",{"$f":"IFERROR(VLOOKUP(INDIRECT($A$5&ROW($A1865)),'State Lookup'!$A:$B,2,FALSE),\"\")","v":""}]
[null,"",{"$f":"IFERROR(VLOOKUP(INDIRECT($A$5&ROW($A1866)),'State Lookup'!$A:$B,2,FALSE),\"\")","v":""}]
[null,"",{"$f":"IFERROR(VLOOKUP(INDIRECT($A$5&ROW($A1867)),'State Lookup'!$A:$B,2,FALSE),\"\")","v":""}]
[null,"",{"$f":"IFERROR(VLOOKUP(INDIRECT($A$5&ROW($A1868)),'State Lookup'!$A:$B,2,FALSE),\"\")","v":""}]
[null,"",{"$f":"IFERROR(VLOOKUP(INDIRECT($A$5&ROW($A1869)),'State Lookup'!$A:$B,2,FALSE),\"\")","v":""}]
[null,"",{"$f":"IFERROR(VLOOKUP(INDIRECT($A$5&ROW($A1870)),'State Lookup'!$A:$B,2,FALSE),\"\")","v":""}]
[null,"",{"$f":"IFERROR(VLOOKUP(INDIRECT($A$5&ROW($A1871)),'State Lookup'!$A:$B,2,FALSE),\"\")","v":""}]
[null,"",{"$f":"IFERROR(VLOOKUP(INDIRECT($A$5&ROW($A1872)),'State Lookup'!$A:$B,2,FALSE),\"\")","v":""}]
[null,"",{"$f":"IFERROR(VLOOKUP(INDIRECT($A$5&ROW($A1873)),'State Lookup'!$A:$B,2,FALSE),\"\")","v":""}]
[null,"",{"$f":"IFERROR(VLOOKUP(INDIRECT($A$5&ROW($A1874)),'State Lookup'!$A:$B,2,FALSE),\"\")","v":""}]
[null,"",{"$f":"IFERROR(VLOOKUP(INDIRECT($A$5&ROW($A1875)),'State Lookup'!$A:$B,2,FALSE),\"\")","v":""}]
[null,"",{"$f":"IFERROR(VLOOKUP(INDIRECT($A$5&ROW($A1876)),'State Lookup'!$A:$B,2,FALSE),\"\")","v":""}]
[null,"",{"$f":"IFERROR(VLOOKUP(INDIRECT($A$5&ROW($A1877)),'State Lookup'!$A:$B,2,FALSE),\"\")","v":""}]
[null,"",{"$f":"IFERROR(VLOOKUP(INDIRECT($A$5&ROW($A1878)),'State Lookup'!$A:$B,2,FALSE),\"\")","v":""}]
[null,"",{"$f":"IFERROR(VLOOKUP(INDIRECT($A$5&ROW($A1879)),'State Lookup'!$A:$B,2,FALSE),\"\")","v":""}]
[null,"",{"$f":"IFERROR(VLOOKUP(INDIRECT($A$5&ROW($A1880)),'State Lookup'!$A:$B,2,FALSE),\"\")","v":""}]
[null,"",{"$f":"IFERROR(VLOOKUP(INDIRECT($A$5&ROW($A1881)),'State Lookup'!$A:$B,2,FALSE),\"\")","v":""}]
[null,"",{"$f":"IFERROR(VLOOKUP(INDIRECT($A$5&ROW($A1882)),'State Lookup'!$A:$B,2,FALSE),\"\")","v":""}]
[null,"",{"$f":"IFERROR(VLOOKUP(INDIRECT($A$5&ROW($A1883)),'State Lookup'!$A:$B,2,FALSE),\"\")","v":""}]
[null,"",{"$f":"IFERROR(VLOOKUP(INDIRECT($A$5&ROW($A1884)),'State Lookup'!$A:$B,2,FALSE),\"\")","v":""}]
[null,"",{"$f":"IFERROR(VLOOKUP(INDIRECT($A$5&ROW($A1885)),'State Lookup'!$A:$B,2,FALSE),\"\")","v":""}]
[null,"",{"$f":"IFERROR(VLOOKUP(INDIRECT($A$5&ROW($A1886)),'State Lookup'!$A:$B,2,FALSE),\"\")","v":""}]
[null,"",{"$f":"IFERROR(VLOOKUP(INDIRECT($A$5&ROW($A1887)),'State Lookup'!$A:$B,2,FALSE),\"\")","v":""}]
[null,"",{"$f":"IFERROR(VLOOKUP(INDIRECT($A$5&ROW($A1888)),'State Lookup'!$A:$B,2,FALSE),\"\")","v":""}]
[null,"",{"$f":"IFERROR(VLOOKUP(INDIRECT($A$5&ROW($A1889)),'State Lookup'!$A:$B,2,FALSE),\"\")","v":""}]
[null,"",{"$f":"IFERROR(VLOOKUP(INDIRECT($A$5&ROW($A1890)),'State Lookup'!$A:$B,2,FALSE),\"\")","v":""}]
[null,"",{"$f":"IFERROR(VLOOKUP(INDIRECT($A$5&ROW($A1891)),'State Lookup'!$A:$B,2,FALSE),\"\")","v":""}]
[null,"",{"$f":"IFERROR(VLOOKUP(INDIRECT($A$5&ROW($A1892)),'State Lookup'!$A:$B,2,FALSE),\"\")","v":""}]
[null,"",{"$f":"IFERROR(VLOOKUP(INDIRECT($A$5&ROW($A1893)),'State Lookup'!$A:$B,2,FALSE),\"\")","v":""}]
[null,"",{"$f":"IFERROR(VLOOKUP(INDIRECT($A$5&ROW($A1894)),'State Lookup'!$A:$B,2,FALSE),\"\")","v":""}]
[null,"",{"$f":"IFERROR(VLOOKUP(INDIRECT($A$5&ROW($A1895)),'State Lookup'!$A:$B,2,FALSE),\"\")","v":""}]
[null,"",{"$f":"IFERROR(VLOOKUP(INDIRECT($A$5&ROW($A1896)),'State Lookup'!$A:$B,2,FALSE),\"\")","v":""}]
[null,"",{"$f":"IFERROR(VLOOKUP(INDIRECT($A$5&ROW($A1897)),'State Lookup'!$A:$B,2,FALSE),\"\")","v":""}]
[null,"",{"$f":"IFERROR(VLOOKUP(INDIRECT($A$5&ROW($A1898)),'State Lookup'!$A:$B,2,FALSE),\"\")","v":""}]
[null,"",{"$f":"IFERROR(VLOOKUP(INDIRECT($A$5&ROW($A1899)),'State Lookup'!$A:$B,2,FALSE),\"\")","v":""}]
[null,"",{"$f":"IFERROR(VLOOKUP(INDIRECT($A$5&ROW($A1900)),'State Lookup'!$A:$B,2,FALSE),\"\")","v":""}]
[null,"",{"$f":"IFERROR(VLOOKUP(INDIRECT($A$5&ROW($A1901)),'State Lookup'!$A:$B,2,FALSE),\"\")","v":""}]
[null,"",{"$f":"IFERROR(VLOOKUP(INDIRECT($A$5&ROW($A1902)),'State Lookup'!$A:$B,2,FALSE),\"\")","v":""}]
[null,"",{"$f":"IFERROR(VLOOKUP(INDIRECT($A$5&ROW($A1903)),'State Lookup'!$A:$B,2,FALSE),\"\")","v":""}]
[null,"",{"$f":"IFERROR(VLOOKUP(INDIRECT($A$5&ROW($A1904)),'State Lookup'!$A:$B,2,FALSE),\"\")","v":""}]
[null,"",{"$f":"IFERROR(VLOOKUP(INDIRECT($A$5&ROW($A1905)),'State Lookup'!$A:$B,2,FALSE),\"\")","v":""}]
[null,"",{"$f":"IFERROR(VLOOKUP(INDIRECT($A$5&ROW($A1906)),'State Lookup'!$A:$B,2,FALSE),\"\")","v":""}]
[null,"",{"$f":"IFERROR(VLOOKUP(INDIRECT($A$5&ROW($A1907)),'State Lookup'!$A:$B,2,FALSE),\"\")","v":""}]
[null,"",{"$f":"IFERROR(VLOOKUP(INDIRECT($A$5&ROW($A1908)),'State Lookup'!$A:$B,2,FALSE),\"\")","v":""}]
[null,"",{"$f":"IFERROR(VLOOKUP(INDIRECT($A$5&ROW($A1909)),'State Lookup'!$A:$B,2,FALSE),\"\")","v":""}]
[null,"",{"$f":"IFERROR(VLOOKUP(INDIRECT($A$5&ROW($A1910)),'State Lookup'!$A:$B,2,FALSE),\"\")","v":""}]
[null,"",{"$f":"IFERROR(VLOOKUP(INDIRECT($A$5&ROW($A1911)),'State Lookup'!$A:$B,2,FALSE),\"\")","v":""}]
[null,"",{"$f":"IFERROR(VLOOKUP(INDIRECT($A$5&ROW($A1912)),'State Lookup'!$A:$B,2,FALSE),\"\")","v":""}]
[null,"",{"$f":"IFERROR(VLOOKUP(INDIRECT($A$5&ROW($A1913)),'State Lookup'!$A:$B,2,FALSE),\"\")","v":""}]
[null,"",{"$f":"IFERROR(VLOOKUP(INDIRECT($A$5&ROW($A1914)),'State Lookup'!$A:$B,2,FALSE),\"\")","v":""}]
[null,"",{"$f":"IFERROR(VLOOKUP(INDIRECT($A$5&ROW($A1915)),'State Lookup'!$A:$B,2,FALSE),\"\")","v":""}]
[null,"",{"$f":"IFERROR(VLOOKUP(INDIRECT($A$5&ROW($A1916)),'State Lookup'!$A:$B,2,FALSE),\"\")","v":""}]
[null,"",{"$f":"IFERROR(VLOOKUP(INDIRECT($A$5&ROW($A1917)),'State Lookup'!$A:$B,2,FALSE),\"\")","v":""}]
[null,"",{"$f":"IFERROR(VLOOKUP(INDIRECT($A$5&ROW($A1918)),'State Lookup'!$A:$B,2,FALSE),\"\")","v":""}]
[null,"",{"$f":"IFERROR(VLOOKUP(INDIRECT($A$5&ROW($A1919)),'State Lookup'!$A:$B,2,FALSE),\"\")","v":""}]
[null,"",{"$f":"IFERROR(VLOOKUP(INDIRECT($A$5&ROW($A1920)),'State Lookup'!$A:$B,2,FALSE),\"\")","v":""}]
[null,"",{"$f":"IFERROR(VLOOKUP(INDIRECT($A$5&ROW($A1921)),'State Lookup'!$A:$B,2,FALSE),\"\")","v":""}]
[null,"",{"$f":"IFERROR(VLOOKUP(INDIRECT($A$5&ROW($A1922)),'State Lookup'!$A:$B,2,FALSE),\"\")","v":""}]
[null,{"$f":"IFERROR((INDIRECT($A$3&ROW($A1923))/INDIRECT($A$1&ROW($A1923)))*100,\"\")","v":""},{"$f":"IFERROR(VLOOKUP(INDIRECT($A$5&ROW($A1923)),'State Lookup'!$A:$B,2,FALSE),\"\")","v":""}]
[null,"",{"$f":"IFERROR(VLOOKUP(INDIRECT($A$5&ROW($A1924)),'State Lookup'!$A:$B,2,FALSE),\"\")","v":""}]
[null,"",{"$f":"IFERROR(VLOOKUP(INDIRECT($A$5&ROW($A1925)),'State Lookup'!$A:$B,2,FALSE),\"\")","v":""}]
[null,"",{"$f":"IFERROR(VLOOKUP(INDIRECT($A$5&ROW($A1926)),'State Lookup'!$A:$B,2,FALSE),\"\")","v":""}]
[null,"",{"$f":"IFERROR(VLOOKUP(INDIRECT($A$5&ROW($A1927)),'State Lookup'!$A:$B,2,FALSE),\"\")","v":""}]
[null,"",{"$f":"IFERROR(VLOOKUP(INDIRECT($A$5&ROW($A1928)),'State Lookup'!$A:$B,2,FALSE),\"\")","v":""}]
[null,"",{"$f":"IFERROR(VLOOKUP(INDIRECT($A$5&ROW($A1929)),'State Lookup'!$A:$B,2,FALSE),\"\")","v":""}]
[null,"",{"$f":"IFERROR(VLOOKUP(INDIRECT($A$5&ROW($A1930)),'State Lookup'!$A:$B,2,FALSE),\"\")","v":""}]
[null,"",{"$f":"IFERROR(VLOOKUP(INDIRECT($A$5&ROW($A1931)),'State Lookup'!$A:$B,2,FALSE),\"\")","v":""}]
[null,"",{"$f":"IFERROR(VLOOKUP(INDIRECT($A$5&ROW($A1932)),'State Lookup'!$A:$B,2,FALSE),\"\")","v":""}]
[null,"",{"$f":"IFERROR(VLOOKUP(INDIRECT($A$5&ROW($A1933)),'State Lookup'!$A:$B,2,FALSE),\"\")","v":""}]
[null,"",{"$f":"IFERROR(VLOOKUP(INDIRECT($A$5&ROW($A1934)),'State Lookup'!$A:$B,2,FALSE),\"\")","v":""}]
[null,"",{"$f":"IFERROR(VLOOKUP(INDIRECT($A$5&ROW($A1935)),'State Lookup'!$A:$B,2,FALSE),\"\")","v":""}]
[null,"",{"$f":"IFERROR(VLOOKUP(INDIRECT($A$5&ROW($A1936)),'State Lookup'!$A:$B,2,FALSE),\"\")","v":""}]
[null,"",{"$f":"IFERROR(VLOOKUP(INDIRECT($A$5&ROW($A1937)),'State Lookup'!$A:$B,2,FALSE),\"\")","v":""}]
[null,"",{"$f":"IFERROR(VLOOKUP(INDIRECT($A$5&ROW($A1938)),'State Lookup'!$A:$B,2,FALSE),\"\")","v":""}]
[null,"",{"$f":"IFERROR(VLOOKUP(INDIRECT($A$5&ROW($A1939)),'State Lookup'!$A:$B,2,FALSE),\"\")","v":""}]
[null,"",{"$f":"IFERROR(VLOOKUP(INDIRECT($A$5&ROW($A1940)),'State Lookup'!$A:$B,2,FALSE),\"\")","v":""}]
[null,"",{"$f":"IFERROR(VLOOKUP(INDIRECT($A$5&ROW($A1941)),'State Lookup'!$A:$B,2,FALSE),\"\")","v":""}]
[null,"",{"$f":"IFERROR(VLOOKUP(INDIRECT($A$5&ROW($A1942)),'State Lookup'!$A:$B,2,FALSE),\"\")","v":""}]
[null,"",{"$f":"IFERROR(VLOOKUP(INDIRECT($A$5&ROW($A1943)),'State Lookup'!$A:$B,2,FALSE),\"\")","v":""}]
[null,"",{"$f":"IFERROR(VLOOKUP(INDIRECT($A$5&ROW($A1944)),'State Lookup'!$A:$B,2,FALSE),\"\")","v":""}]
[null,"",{"$f":"IFERROR(VLOOKUP(INDIRECT($A$5&ROW($A1945)),'State Lookup'!$A:$B,2,FALSE),\"\")","v":""}]
[null,"",{"$f":"IFERROR(VLOOKUP(INDIRECT($A$5&ROW($A1946)),'State Lookup'!$A:$B,2,FALSE),\"\")","v":""}]
[null,"",{"$f":"IFERROR(VLOOKUP(INDIRECT($A$5&ROW($A1947)),'State Lookup'!$A:$B,2,FALSE),\"\")","v":""}]
[null,"",{"$f":"IFERROR(VLOOKUP(INDIRECT($A$5&ROW($A1948)),'State Lookup'!$A:$B,2,FALSE),\"\")","v":""}]
[null,"",{"$f":"IFERROR(VLOOKUP(INDIRECT($A$5&ROW($A1949)),'State Lookup'!$A:$B,2,FALSE),\"\")","v":""}]
[null,"",{"$f":"IFERROR(VLOOKUP(INDIRECT($A$5&ROW($A1950)),'State Lookup'!$A:$B,2,FALSE),\"\")","v":""}]
[null,"",{"$f":"IFERROR(VLOOKUP(INDIRECT($A$5&ROW($A1951)),'State Lookup'!$A:$B,2,FALSE),\"\")","v":""}]
[null,"",{"$f":"IFERROR(VLOOKUP(INDIRECT($A$5&ROW($A1952)),'State Lookup'!$A:$B,2,FALSE),\"\")","v":""}]
[null,"",{"$f":"IFERROR(VLOOKUP(INDIRECT($A$5&ROW($A1953)),'State Lookup'!$A:$B,2,FALSE),\"\")","v":""}]
[null,"",{"$f":"IFERROR(VLOOKUP(INDIRECT($A$5&ROW($A1954)),'State Lookup'!$A:$B,2,FALSE),\"\")","v":""}]
[null,"",{"$f":"IFERROR(VLOOKUP(INDIRECT($A$5&ROW($A1955)),'State Lookup'!$A:$B,2,FALSE),\"\")","v":""}]
[null,"",{"$f":"IFERROR(VLOOKUP(INDIRECT($A$5&ROW($A1956)),'State Lookup'!$A:$B,2,FALSE),\"\")","v":""}]
[null,"",{"$f":"IFERROR(VLOOKUP(INDIRECT($A$5&ROW($A1957)),'State Lookup'!$A:$B,2,FALSE),\"\")","v":""}]
[null,"",{"$f":"IFERROR(VLOOKUP(INDIRECT($A$5&ROW($A1958)),'State Lookup'!$A:$B,2,FALSE),\"\")","v":""}]
[null,"",{"$f":"IFERROR(VLOOKUP(INDIRECT($A$5&ROW($A1959)),'State Lookup'!$A:$B,2,FALSE),\"\")","v":""}]
[null,"",{"$f":"IFERROR(VLOOKUP(INDIRECT($A$5&ROW($A1960)),'State Lookup'!$A:$B,2,FALSE),\"\")","v":""}]
[null,"",{"$f":"IFERROR(VLOOKUP(INDIRECT($A$5&ROW($A1961)),'State Lookup'!$A:$B,2,FALSE),\"\")","v":""}]
[null,"",{"$f":"IFERROR(VLOOKUP(INDIRECT($A$5&ROW($A1962)),'State Lookup'!$A:$B,2,FALSE),\"\")","v":""}]
[null,"",{"$f":"IFERROR(VLOOKUP(INDIRECT($A$5&ROW($A1963)),'State Lookup'!$A:$B,2,FALSE),\"\")","v":""}]
[null,"",{"$f":"IFERROR(VLOOKUP(INDIRECT($A$5&ROW($A1964)),'State Lookup'!$A:$B,2,FALSE),\"\")","v":""}]
[null,"",{"$f":"IFERROR(VLOOKUP(INDIRECT($A$5&ROW($A1965)),'State Lookup'!$A:$B,2,FALSE),\"\")","v":""}]
[null,"",{"$f":"IFERROR(VLOOKUP(INDIRECT($A$5&ROW($A1966)),'State Lookup'!$A:$B,2,FALSE),\"\")","v":""}]
[null,"",{"$f":"IFERROR(VLOOKUP(INDIRECT($A$5&ROW($A1967)),'State Lookup'!$A:$B,2,FALSE),\"\")","v":""}]
[null,"",{"$f":"IFERROR(VLOOKUP(INDIRECT($A$5&ROW($A1968)),'State Lookup'!$A:$B,2,FALSE),\"\")","v":""}]
[null,"",{"$f":"IFERROR(VLOOKUP(INDIRECT($A$5&ROW($A1969)),'State Lookup'!$A:$B,2,FALSE),\"\")","v":""}]
[null,"",{"$f":"IFERROR(VLOOKUP(INDIRECT($A$5&ROW($A1970)),'State Lookup'!$A:$B,2,FALSE),\"\")","v":""}]
[null,"",{"$f":"IFERROR(VLOOKUP(INDIRECT($A$5&ROW($A1971)),'State Lookup'!$A:$B,2,FALSE),\"\")","v":""}]
[null,"",{"$f":"IFERROR(VLOOKUP(INDIRECT($A$5&ROW($A1972)),'State Lookup'!$A:$B,2,FALSE),\"\")","v":""}]
[null,"",{"$f":"IFERROR(VLOOKUP(INDIRECT($A$5&ROW($A1973)),'State Lookup'!$A:$B,2,FALSE),\"\")","v":""}]
[null,"",{"$f":"IFERROR(VLOOKUP(INDIRECT($A$5&ROW($A1974)),'State Lookup'!$A:$B,2,FALSE),\"\")","v":""}]
[null,"",{"$f":"IFERROR(VLOOKUP(INDIRECT($A$5&ROW($A1975)),'State Lookup'!$A:$B,2,FALSE),\"\")","v":""}]
[null,"",{"$f":"IFERROR(VLOOKUP(INDIRECT($A$5&ROW($A1976)),'State Lookup'!$A:$B,2,FALSE),\"\")","v":""}]
[null,"",{"$f":"IFERROR(VLOOKUP(INDIRECT($A$5&ROW($A1977)),'State Lookup'!$A:$B,2,FALSE),\"\")","v":""}]
[null,"",{"$f":"IFERROR(VLOOKUP(INDIRECT($A$5&ROW($A1978)),'State Lookup'!$A:$B,2,FALSE),\"\")","v":""}]
[null,"",{"$f":"IFERROR(VLOOKUP(INDIRECT($A$5&ROW($A1979)),'State Lookup'!$A:$B,2,FALSE),\"\")","v":""}]
[null,"",{"$f":"IFERROR(VLOOKUP(INDIRECT($A$5&ROW($A1980)),'State Lookup'!$A:$B,2,FALSE),\"\")","v":""}]
[null,"",{"$f":"IFERROR(VLOOKUP(INDIRECT($A$5&ROW($A1981)),'State Lookup'!$A:$B,2,FALSE),\"\")","v":""}]
[null,"",{"$f":"IFERROR(VLOOKUP(INDIRECT($A$5&ROW($A1982)),'State Lookup'!$A:$B,2,FALSE),\"\")","v":""}]
[null,"",{"$f":"IFERROR(VLOOKUP(INDIRECT($A$5&ROW($A1983)),'State Lookup'!$A:$B,2,FALSE),\"\")","v":""}]
[null,"",{"$f":"IFERROR(VLOOKUP(INDIRECT($A$5&ROW($A1984)),'State Lookup'!$A:$B,2,FALSE),\"\")","v":""}]
[null,"",{"$f":"IFERROR(VLOOKUP(INDIRECT($A$5&ROW($A1985)),'State Lookup'!$A:$B,2,FALSE),\"\")","v":""}]
[null,"",{"$f":"IFERROR(VLOOKUP(INDIRECT($A$5&ROW($A1986)),'State Lookup'!$A:$B,2,FALSE),\"\")","v":""}]
[null,{"$f":"IFERROR((INDIRECT($A$3&ROW($A1987))/INDIRECT($A$1&ROW($A1987)))*100,\"\")","v":""},{"$f":"IFERROR(VLOOKUP(INDIRECT($A$5&ROW($A1987)),'State Lookup'!$A:$B,2,FALSE),\"\")","v":""}]
[null,"",{"$f":"IFERROR(VLOOKUP(INDIRECT($A$5&ROW($A1988)),'State Lookup'!$A:$B,2,FALSE),\"\")","v":""}]
[null,"",{"$f":"IFERROR(VLOOKUP(INDIRECT($A$5&ROW($A1989)),'State Lookup'!$A:$B,2,FALSE),\"\")","v":""}]
[null,"",{"$f":"IFERROR(VLOOKUP(INDIRECT($A$5&ROW($A1990)),'State Lookup'!$A:$B,2,FALSE),\"\")","v":""}]
[null,"",{"$f":"IFERROR(VLOOKUP(INDIRECT($A$5&ROW($A1991)),'State Lookup'!$A:$B,2,FALSE),\"\")","v":""}]
[null,"",{"$f":"IFERROR(VLOOKUP(INDIRECT($A$5&ROW($A1992)),'State Lookup'!$A:$B,2,FALSE),\"\")","v":""}]
[null,"",{"$f":"IFERROR(VLOOKUP(INDIRECT($A$5&ROW($A1993)),'State Lookup'!$A:$B,2,FALSE),\"\")","v":""}]
[null,"",{"$f":"IFERROR(VLOOKUP(INDIRECT($A$5&ROW($A1994)),'State Lookup'!$A:$B,2,FALSE),\"\")","v":""}]
[null,"",{"$f":"IFERROR(VLOOKUP(INDIRECT($A$5&ROW($A1995)),'State Lookup'!$A:$B,2,FALSE),\"\")","v":""}]
[null,"",{"$f":"IFERROR(VLOOKUP(INDIRECT($A$5&ROW($A1996)),'State Lookup'!$A:$B,2,FALSE),\"\")","v":""}]
[null,"",{"$f":"IFERROR(VLOOKUP(INDIRECT($A$5&ROW($A1997)),'State Lookup'!$A:$B,2,FALSE),\"\")","v":""}]
[null,"",{"$f":"IFERROR(VLOOKUP(INDIRECT($A$5&ROW($A1998)),'State Lookup'!$A:$B,2,FALSE),\"\")","v":""}]
[null,"",{"$f":"IFERROR(VLOOKUP(INDIRECT($A$5&ROW($A1999)),'State Lookup'!$A:$B,2,FALSE),\"\")","v":""}]
[null,"",{"$f":"IFERROR(VLOOKUP(INDIRECT($A$5&ROW($A2000)),'State Lookup'!$A:$B,2,FALSE),\"\")","v":""}]

{"sheet":"State Lookup","index":5,"n_rows":56,"n_cols":2,"rows_kept":56,"cut":false,"hidden":true,"merged":[]}
["Region","State"]
["Central & Hills S.A.","SA"]
["CENTRAL COAST NSW","NSW"]
["Central Queensland","QLD"]
["Central Victoria","VIC"]
["Central Western NSW","NSW"]
["Eastern Pastoral S.A.","SA"]
["Esperance/Dundas W.A.","WA"]
["Far North Coast NSW","NSW"]
["Flinders Island","TAS"]
["Gascoyne W.A.","WA"]
["Gippsland Victoria","VIC"]
["Greenough W.A.","WA"]
["Hunter NSW","NSW"]
["ILLAWARRA NSW","NSW"]
["Kangaroo Island S.A.","SA"]
["Kimberley W.A.","WA"]
["Lower Great Southern W.A.","WA"]
["Lower SE S.A.","SA"]
["METROPOLITAN NSW","NSW"]
["Metropolitan S.A.","SA"]
["Metropolitan Victoria","VIC"]
["Mid & Upper North S.A.","SA"]
["Midlands W.A.","WA"]
["Monaro NSW","NSW"]
["N.W. Slopes & Plains","NSW"]
["N/E Victoria","VIC"]
["N/W Victoria","VIC"]
["North Coast NSW","NSW"]
["North Eastern Tasmania","TAS"]
["North Queensland","QLD"]
["North Western Tasmania","TAS"]
["Northern Tasmania","TAS"]
["Northern Territory","NT"]
["Northern T'Land NSW","NSW"]
["Northern Victoria","VIC"]
["Pilbara W.A.","WA"]
["Riverina NSW","NSW"]
["Riverland & Mallee S.A.","SA"]
["S.W. Victoria","VIC"]
["Snowy Victoria","VIC"]
["South Coast NSW","NSW"]
["South Eastern W.A.","WA"]
["SOUTH WESTERN W.A.","WA"]
["Southern Queensland","QLD"]
["Southern Tablelands","NSW"]
["Southern Tasmania","TAS"]
["SW Slopes & Plains","NSW"]
["TASMANIA","TAS"]
["Upper Great Southern W.A.","WA"]
["Upper SE S.A.","SA"]
["West Coast S.A.","SA"]
["West Pastoral Area S.A.","SA"]
["WESTERN NSW","NSW"]
["Western Queensland","QLD"]
["Yorke Penninsula","SA"]