{"text_format":"1","workbook":"xlsx","n_sheets":6,"sheets":["Instructions","Steers Graph","Heifers Graph","Results","ckg table","State Lookup"],"not_rendered":{"charts":2,"images":2,"macros":1,"external_links":0,"defined_names":1,"comments":0,"pivot_tables":0},"unopened":[],"bounds":{"document_bytes":16777216,"sheet_cells":100000,"rows_first":2000,"rows_last":500,"rows_between":2000,"halvings":0,"cell_chars":16384,"cell_head_chars":4096},"cells_cut":0,"cells_raw":0,"read":"whole","date_system":"1900"}

{"sheet":"Instructions","index":0,"n_rows":3,"n_cols":2,"rows_kept":3,"cut":false,"hidden":false,"merged":[]}
["Step","Description"]
[1,"Delete all data sitting in the \"Results\" tab including HEADINGS! Then copy across this week's data. Click \"Ctrl+S\" to prompt the spreadsheet to make its calculations"]
[2,"The green tabs contain the graphs. You will need to add this week's calculated data to the graph data by clicking the button you find in those tabs"]

{"sheet":"Steers Graph","index":1,"n_rows":26,"n_cols":27,"rows_kept":26,"cut":false,"hidden":false,"merged":[]}
[null,null,null,"Steers Graphs"]
[null,null,null,"Rolling 15 Weeks"]
[]
[]
[null,null,"This Week"]
[null,null,"No Touchy! - Calculated Field",null,null,null,null,null,null,null,null,null,null,null,null,null,null,null,null,null,"Weight Min","Weight Max","Sex",null,{"$f":"\"'Results'!\"&IF(MATCH(Y7,INDIRECT(\"Results!1:1\"),0)>=53,\"b\"&CHAR(64+MATCH(Y7,INDIRECT(\"Results!1:1\"),0)-52),IF(MATCH(Y7,INDIRECT(\"Results!1:1\"),0)>=27,\"A\"&CHAR(64+MATCH(Y7,INDIRECT(\"Results!1:1\"),0)-26),CHAR(64+MATCH(Y7,INDIRECT(\"Results!1:1\"),0))))&\":\"&IF(MATCH(Y7,INDIRECT(\"Results!1:1\"),0)>=53,\"b\"&CHAR(64+MATCH(Y7,INDIRECT(\"Results!1:1\"),0)-52),IF(MATCH(Y7,INDIRECT(\"Results!1:1\"),0)>=27,\"A\"&CHAR(64+MATCH(Y7,INDIRECT(\"Results!1:1\"),0)-26),CHAR(64+MATCH(Y7,INDIRECT(\"Results!1:1\"),0))))","v":"'Results'!J:J"}]
[null,null,"Weight Range (kg)","Avg (c/kg)",null,null,null,null,null,null,null,null,null,null,null,null,null,null,null,null,0,250,"Steer",null,"Sex "]
[null,null,"0-249",{"$f":"IFERROR((SUMIFS('ckg table'!$B:$B,INDIRECT($Y$6),$W7,INDIRECT($Y$21),\"<\"&$V7,INDIRECT($Y$21),\">=\"&$U7,INDIRECT($Y$8),\"Sold\",INDIRECT($Y$10),\"<>*Wagyu*\"))/COUNTIFS(INDIRECT($Y$6),$W7,INDIRECT($Y$21),\"<\"&$V7,INDIRECT($Y$21),\">=\"&$U7,INDIRECT($Y$8),\"Sold\",INDIRECT($Y$10),\"<>*Wagyu*\"),0)","v":344.15335999147447},null,null,null,null,null,null,null,null,null,null,null,null,null,null,null,null,250,300,"Steer",null,{"$f":"\"'Results'!\"&IF(MATCH(Y9,INDIRECT(\"Results!1:1\"),0)>=53,\"b\"&CHAR(64+MATCH(Y9,INDIRECT(\"Results!1:1\"),0)-52),IF(MATCH(Y9,INDIRECT(\"Results!1:1\"),0)>=27,\"A\"&CHAR(64+MATCH(Y9,INDIRECT(\"Results!1:1\"),0)-26),CHAR(64+MATCH(Y9,INDIRECT(\"Results!1:1\"),0))))&\":\"&IF(MATCH(Y9,INDIRECT(\"Results!1:1\"),0)>=53,\"b\"&CHAR(64+MATCH(Y9,INDIRECT(\"Results!1:1\"),0)-52),IF(MATCH(Y9,INDIRECT(\"Results!1:1\"),0)>=27,\"A\"&CHAR(64+MATCH(Y9,INDIRECT(\"Results!1:1\"),0)-26),CHAR(64+MATCH(Y9,INDIRECT(\"Results!1:1\"),0))))","v":"'Results'!X:X"}]
[null,null,"250-299",{"$f":"IFERROR((SUMIFS('ckg table'!$B:$B,INDIRECT($Y$6),$W8,INDIRECT($Y$21),\"<\"&$V8,INDIRECT($Y$21),\">=\"&$U8,INDIRECT($Y$8),\"Sold\",INDIRECT($Y$10),\"<>*Wagyu*\"))/COUNTIFS(INDIRECT($Y$6),$W8,INDIRECT($Y$21),\"<\"&$V8,INDIRECT($Y$21),\">=\"&$U8,INDIRECT($Y$8),\"Sold\",INDIRECT($Y$10),\"<>*Wagyu*\"),0)","v":311.1707710761014},null,null,null,null,null,null,null,null,null,null,null,null,null,null,null,null,300,350,"Steer",null,"LotStatus "]
[null,null,"300-349",{"$f":"IFERROR((SUMIFS('ckg table'!$B:$B,INDIRECT($Y$6),$W9,INDIRECT($Y$21),\"<\"&$V9,INDIRECT($Y$21),\">=\"&$U9,INDIRECT($Y$8),\"Sold\",INDIRECT($Y$10),\"<>*Wagyu*\"))/COUNTIFS(INDIRECT($Y$6),$W9,INDIRECT($Y$21),\"<\"&$V9,INDIRECT($Y$21),\">=\"&$U9,INDIRECT($Y$8),\"Sold\",INDIRECT($Y$10),\"<>*Wagyu*\"),0)","v":313.51610350080335},null,null,null,null,null,null,null,null,null,null,null,null,null,null,null,null,350,400,"Steer",null,{"$f":"\"'Results'!\"&IF(MATCH(Y11,INDIRECT(\"Results!1:1\"),0)>=53,\"b\"&CHAR(64+MATCH(Y11,INDIRECT(\"Results!1:1\"),0)-52),IF(MATCH(Y11,INDIRECT(\"Results!1:1\"),0)>=27,\"A\"&CHAR(64+MATCH(Y11,INDIRECT(\"Results!1:1\"),0)-26),CHAR(64+MATCH(Y11,INDIRECT(\"Results!1:1\"),0))))&\":\"&IF(MATCH(Y11,INDIRECT(\"Results!1:1\"),0)>=53,\"b\"&CHAR(64+MATCH(Y11,INDIRECT(\"Results!1:1\"),0)-52),IF(MATCH(Y11,INDIRECT(\"Results!1:1\"),0)>=27,\"A\"&CHAR(64+MATCH(Y11,INDIRECT(\"Results!1:1\"),0)-26),CHAR(64+MATCH(Y11,INDIRECT(\"Results!1:1\"),0))))","v":"'Results'!F:F"}]
[null,null,"350+",{"$f":"IFERROR((SUMIFS('ckg table'!$B:$B,INDIRECT($Y$6),$W10,INDIRECT($Y$21),\">=\"&$U10,INDIRECT($Y$8),\"Sold\",INDIRECT($Y$10),\"<>*Wagyu*\"))/COUNTIFS(INDIRECT($Y$6),$W10,INDIRECT($Y$21),\">=\"&$U10,INDIRECT($Y$8),\"Sold\",INDIRECT($Y$10),\"<>*Wagyu*\"),0)","v":276.57002298590612},null,null,null,null,null,null,null,null,null,null,null,null,null,null,null,null,400,450,"Steer",null,"MajorityBreed "]
[null,null,null,null,null,null,null,null,null,null,null,null,null,null,null,null,null,null,null,null,450,null,"Steer",null,{"$f":"\"'Results'!\"&IF(MATCH(Y13,INDIRECT(\"Results!1:1\"),0)>=53,\"b\"&CHAR(64+MATCH(Y13,INDIRECT(\"Results!1:1\"),0)-52),IF(MATCH(Y13,INDIRECT(\"Results!1:1\"),0)>=27,\"A\"&CHAR(64+MATCH(Y13,INDIRECT(\"Results!1:1\"),0)-26),CHAR(64+MATCH(Y13,INDIRECT(\"Results!1:1\"),0))))&\":\"&IF(MATCH(Y13,INDIRECT(\"Results!1:1\"),0)>=53,\"b\"&CHAR(64+MATCH(Y13,INDIRECT(\"Results!1:1\"),0)-52),IF(MATCH(Y13,INDIRECT(\"Results!1:1\"),0)>=27,\"A\"&CHAR(64+MATCH(Y13,INDIRECT(\"Results!1:1\"),0)-26),CHAR(64+MATCH(Y13,INDIRECT(\"Results!1:1\"),0))))","v":"'Results'!K:K"}]
[null,null,null,null,null,null,null,null,null,null,null,null,null,null,null,null,null,null,null,null,null,null,null,null,"LotBestDescription "]
[]
[]
[]
[]
[]
[]
[null,null,"Graph Data"]
{"$rows_left_out":7}
{"sheet":"Heifers Graph","index":2,"n_rows":26,"n_cols":26,"rows_kept":26,"cut":false,"hidden":false,"merged":[]}
[null,null,null,"Heifers Graphs"]
[null,null,null,"Rolling 15 Weeks"]
[]
[]
[null,null,"This Week"]
[null,null,"No Touchy! - Calculated Field"]
[null,null,"Weight Range","Avg (c/kg)",null,null,null,null,null,null,null,null,null,null,null,null,null,null,null,{"$f":"\"'Results'!\"&IF(MATCH(T8,INDIRECT(\"Results!1:1\"),0)>=53,\"b\"&CHAR(64+MATCH(T8,INDIRECT(\"Results!1:1\"),0)-52),IF(MATCH(T8,INDIRECT(\"Results!1:1\"),0)>=27,\"A\"&CHAR(64+MATCH(T8,INDIRECT(\"Results!1:1\"),0)-26),CHAR(64+MATCH(T8,INDIRECT(\"Results!1:1\"),0))))&\":\"&IF(MATCH(T8,INDIRECT(\"Results!1:1\"),0)>=53,\"b\"&CHAR(64+MATCH(T8,INDIRECT(\"Results!1:1\"),0)-52),IF(MATCH(T8,INDIRECT(\"Results!1:1\"),0)>=27,\"A\"&CHAR(64+MATCH(T8,INDIRECT(\"Results!1:1\"),0)-26),CHAR(64+MATCH(T8,INDIRECT(\"Results!1:1\"),0))))","v":"'Results'!J:J"},null,"Weight Min","Weight Max","Sex"]
[null,null,"0-249",{"$f":"IFERROR((SUMIFS('ckg table'!$B:$B,INDIRECT($T$7),$X8,INDIRECT($T$15),\"<\"&$W8,INDIRECT($T$15),\">=\"&$V8,INDIRECT($T$9),\"Sold\",INDIRECT($T$13),\"<>\"&\"*PTIC*\",INDIRECT($T$13),\"<>\"&\"*Station Mated*\",INDIRECT($T$11),\"<>*Wagyu*\")/COUNTIFS(INDIRECT($T$7),$X8,INDIRECT($T$15),\"<\"&$W8,INDIRECT($T$15),\">=\"&$V8,INDIRECT($T$9),\"Sold\",INDIRECT($T$13),\"<>\"&\"*PTIC*\",INDIRECT($T$13),\"<>\"&\"*Station Mated*\",INDIRECT($T$11),\"<>*Wagyu*\")),0)","v":295.75110364243739},null,null,null,null,null,null,null,null,null,null,null,null,null,null,null,"Sex ",null,0,250,"Heifer"]
[null,null,"250-299",{"$f":"IFERROR((SUMIFS('ckg table'!$B:$B,INDIRECT($T$7),$X9,INDIRECT($T$15),\"<\"&$W9,INDIRECT($T$15),\">=\"&$V9,INDIRECT($T$9),\"Sold\",INDIRECT($T$13),\"<>\"&\"*PTIC*\",INDIRECT($T$13),\"<>\"&\"*Station Mated*\",INDIRECT($T$11),\"<>*Wagyu*\")/COUNTIFS(INDIRECT($T$7),$X9,INDIRECT($T$15),\"<\"&$W9,INDIRECT($T$15),\">=\"&$V9,INDIRECT($T$9),\"Sold\",INDIRECT($T$13),\"<>\"&\"*PTIC*\",INDIRECT($T$13),\"<>\"&\"*Station Mated*\",INDIRECT($T$11),\"<>*Wagyu*\")),0)","v":286.5736226354594},null,null,null,null,null,null,null,null,null,null,null,null,null,null,null,{"$f":"\"'Results'!\"&IF(MATCH(T10,INDIRECT(\"Results!1:1\"),0)>=53,\"b\"&CHAR(64+MATCH(T10,INDIRECT(\"Results!1:1\"),0)-52),IF(MATCH(T10,INDIRECT(\"Results!1:1\"),0)>=27,\"A\"&CHAR(64+MATCH(T10,INDIRECT(\"Results!1:1\"),0)-26),CHAR(64+MATCH(T10,INDIRECT(\"Results!1:1\"),0))))&\":\"&IF(MATCH(T10,INDIRECT(\"Results!1:1\"),0)>=53,\"b\"&CHAR(64+MATCH(T10,INDIRECT(\"Results!1:1\"),0)-52),IF(MATCH(T10,INDIRECT(\"Results!1:1\"),0)>=27,\"A\"&CHAR(64+MATCH(T10,INDIRECT(\"Results!1:1\"),0)-26),CHAR(64+MATCH(T10,INDIRECT(\"Results!1:1\"),0))))","v":"'Results'!X:X"},null,250,300,"Heifer"]
[null,null,"300-349",{"$f":"IFERROR((SUMIFS('ckg table'!$B:$B,INDIRECT($T$7),$X10,INDIRECT($T$15),\"<\"&$W10,INDIRECT($T$15),\">=\"&$V10,INDIRECT($T$9),\"Sold\",INDIRECT($T$13),\"<>\"&\"*PTIC*\",INDIRECT($T$13),\"<>\"&\"*Station Mated*\",INDIRECT($T$11),\"<>*Wagyu*\")/COUNTIFS(INDIRECT($T$7),$X10,INDIRECT($T$15),\"<\"&$W10,INDIRECT($T$15),\">=\"&$V10,INDIRECT($T$9),\"Sold\",INDIRECT($T$13),\"<>\"&\"*PTIC*\",INDIRECT($T$13),\"<>\"&\"*Station Mated*\",INDIRECT($T$11),\"<>*Wagyu*\")),0)","v":284.79063153570991},null,null,null,null,null,null,null,null,null,null,null,null,null,null,null,"LotStatus ",null,300,350,"Heifer"]
[null,null,"350+",{"$f":"IFERROR((SUMIFS('ckg table'!$B:$B,INDIRECT($T$7),$X11,INDIRECT($T$15),\">=\"&$V11,INDIRECT($T$9),\"Sold\",INDIRECT($T$13),\"<>\"&\"*PTIC*\",INDIRECT($T$13),\"<>\"&\"*Station Mated*\",INDIRECT($T$11),\"<>*Wagyu*\")/COUNTIFS(INDIRECT($T$7),$X11,INDIRECT($T$15),\">=\"&$V11,INDIRECT($T$9),\"Sold\",INDIRECT($T$13),\"<>\"&\"*PTIC*\",INDIRECT($T$13),\"<>\"&\"*Station Mated*\",INDIRECT($T$11),\"<>*Wagyu*\")),0)","v":256.64381495768748},null,null,null,null,null,null,null,null,null,null,null,null,null,null,null,{"$f":"\"'Results'!\"&IF(MATCH(T12,INDIRECT(\"Results!1:1\"),0)>=53,\"b\"&CHAR(64+MATCH(T12,INDIRECT(\"Results!1:1\"),0)-52),IF(MATCH(T12,INDIRECT(\"Results!1:1\"),0)>=27,\"A\"&CHAR(64+MATCH(T12,INDIRECT(\"Results!1:1\"),0)-26),CHAR(64+MATCH(T12,INDIRECT(\"Results!1:1\"),0))))&\":\"&IF(MATCH(T12,INDIRECT(\"Results!1:1\"),0)>=53,\"b\"&CHAR(64+MATCH(T12,INDIRECT(\"Results!1:1\"),0)-52),IF(MATCH(T12,INDIRECT(\"Results!1:1\"),0)>=27,\"A\"&CHAR(64+MATCH(T12,INDIRECT(\"Results!1:1\"),0)-26),CHAR(64+MATCH(T12,INDIRECT(\"Results!1:1\"),0))))","v":"'Results'!F:F"},null,350,null,"Heifer"]
[null,null,null,null,null,null,null,null,null,null,null,null,null,null,null,null,null,null,null,"MajorityBreed "]
[null,null,null,null,null,null,null,null,null,null,null,null,null,null,null,null,null,null,null,{"$f":"\"'Results'!\"&IF(MATCH(T14,INDIRECT(\"Results!1:1\"),0)>=53,\"b\"&CHAR(64+MATCH(T14,INDIRECT(\"Results!1:1\"),0)-52),IF(MATCH(T14,INDIRECT(\"Results!1:1\"),0)>=27,\"A\"&CHAR(64+MATCH(T14,INDIRECT(\"Results!1:1\"),0)-26),CHAR(64+MATCH(T14,INDIRECT(\"Results!1:1\"),0))))&\":\"&IF(MATCH(T14,INDIRECT(\"Results!1:1\"),0)>=53,\"b\"&CHAR(64+MATCH(T14,INDIRECT(\"Results!1:1\"),0)-52),IF(MATCH(T14,INDIRECT(\"Results!1:1\"),0)>=27,\"A\"&CHAR(64+MATCH(T14,INDIRECT(\"Results!1:1\"),0)-26),CHAR(64+MATCH(T14,INDIRECT(\"Results!1:1\"),0))))","v":"'Results'!K:K"}]
[null,null,null,null,null,null,null,null,null,null,null,null,null,null,null,null,null,null,null,"LotBestDescription "]
[null,null,null,null,null,null,null,null,null,null,null,null,null,null,null,null,null,null,null,{"$f":"\"'Results'!\"&IF(MATCH(T16,INDIRECT(\"Results!1:1\"),0)>=53,\"b\"&CHAR(64+MATCH(T16,INDIRECT(\"Results!1:1\"),0)-52),IF(MATCH(T16,INDIRECT(\"Results!1:1\"),0)>=27,\"A\"&CHAR(64+MATCH(T16,INDIRECT(\"Results!1:1\"),0)-26),CHAR(64+MATCH(T16,INDIRECT(\"Results!1:1\"),0))))&\":\"&IF(MATCH(T16,INDIRECT(\"Results!1:1\"),0)>=53,\"b\"&CHAR(64+MATCH(T16,INDIRECT(\"Results!1:1\"),0)-52),IF(MATCH(T16,INDIRECT(\"Results!1:1\"),0)>=27,\"A\"&CHAR(64+MATCH(T16,INDIRECT(\"Results!1:1\"),0)-26),CHAR(64+MATCH(T16,INDIRECT(\"Results!1:1\"),0))))","v":"'Results'!M:M"}]
[null,null,null,null,null,null,null,null,null,null,null,null,null,null,null,null,null,null,null,"LiveWeight "]
[]
[]
[]
[null,null,"Graph Data"]
{"$rows_left_out":7}
{"sheet":"Results","index":3,"n_rows":195,"n_cols":29,"rows_kept":195,"cut":false,"hidden":false,"merged":[]}
["AssessmentNumber ","LotNumber ","LotIdentifier ","NumberOfHead ","StockCategory ","MajorityBreed ","MajorityBreedPercentage ","MajorityFat ","MajorityFatPercentage ","Sex ","LotBestDescription ","InWitholdingOrESI ","LiveWeight ","DressedWeight ","AgeRange","Age ","EarliestDrop ","LatestDrop ","DeliveryTown ","DeliveryRegion ","StartPrice ","ReservePrice ","BidPrice ","LotStatus ","HighBidderTradingName ","HighBidderLat","HighBidderLong","HighBidderTown ","HighBidderState "]
[8264694,800,"Lot 800",80,"Weaners","Red Angus/Brahman Cross",78,"2 L",65,"Steer","Weaned Steers",false,210.2,115.8,"Months","6 to 9",null,null,"RICHMOND","North Queensland",565,670,630,"Passed In","Nogoa Pastoral Pty Ltd",-23.523,148.15799999999999,"EMERALD","QLD"]
[8264708,801,"Lot 801",120,"Weaners","Brahman/Brahman",100,"2 L",87,"Steer","Weaned Steers",false,207.6,114.4,"Months","6 to 9",null,null,"RICHMOND","North Queensland",560,665,625,"Passed In","Nogoa Pastoral Pty Ltd",-23.523,148.15799999999999,"EMERALD","QLD"]
[8266263,802,"Lot 802",175,"Weaners","Brahman/Brahman",57,"2 L",100,"Steer","Weaned Steers",false,206.5,99.1,"Months","12 to 14",null,null,"CORFIELD","Western Queensland",630,650,635,"Passed In","JACK MCDONALD PTY LTD",-28.546399999999998,150.30699999999999,"GOONDIWINDI","QLD"]
[8266310,803,"Lot 803",175,"Weaners","Brahman/Brahman Cross",34,"2 L",100,"Steer","Weaned Steers",false,226.3,108.6,"Months","12 to 14",null,null,"CORFIELD","Western Queensland",690,710,695,"Passed In","A.J. BRITTON AND A.P. MCAULEY",-22.381900000000002,143.042,"WINTON","QLD"]
[8266360,804,"Lot 804",112,"Weaners","Angus/Brahman",54,"2 L",100,"Steer","Weaned Steers",false,234.4,112.5,"Months","12 to 14",null,null,"CORFIELD","Western Queensland",730,750,735,"Passed In","A.J. BRITTON AND A.P. MCAULEY",-22.381900000000002,143.042,"WINTON","QLD"]
[8266182,805,"Lot 805",180,"Weaners","Brahman/Brahman",56,"2 L",100,"Heifer","Weaned Heifers",false,187.6,90.1,"Months","12 to 14",null,null,"CORFIELD","Western Queensland",480,500,500,"Sold","TRUE NORTH PASTORAL PTY LTD ",-14.4649669,132.26425610000001,"KATHERINE","NT"]
[8266220,806,"Lot 806",180,"Weaners","Brahman/Brahman",56,"2 L",100,"Heifer","Weaned Heifers",false,211.1,101.3,"Months","12 to 14",null,null,"CORFIELD","Western Queensland",560,580,570,"Passed In","A.J. BRITTON AND A.P. MCAULEY",-22.381900000000002,143.042,"WINTON","QLD"]
[8266247,807,"Lot 807",120,"Weaners","Angus/Brahman Cross",50,"2 L",100,"Heifer","Weaned Heifers",false,235.1,112.8,"Months","12 to 14",null,null,"CORFIELD","Western Queensland",630,650,630,"No Bids","UNK",null,null,"UNK","UNK"]
[8265887,808,"Lot 808",126,"Weaners","Droughtmaster/Droughtmaster",99,"3 L",72,"Heifer","Weaned Heifers",false,224,119.1,"Months","5 to 7",null,null,"WINTON","Western Queensland",600,620,620,"Sold","ALLIED BEEF",-27.560600000000001,151.95400000000001,"TOOWOOMBA","QLD"]
[8265895,809,"Lot 809",120,"Weaners","Droughtmaster/Droughtmaster",100,"2 H",72,"Steer","Weaned Steers",false,230,122.3,"Months","5 to 7",null,null,"WINTON","Western Queensland",695,720,770,"Sold","HOURN & BISHOP QLD PTY LTD",-24.572199999999999,149.96700000000001,"MOURA","QLD"]
[8266000,810,"Lot 810",80,"Steers","Santa Gertrudis/Santa/Brahman",75,2,100,"Steer","Backgrounder Steers",false,282,148.4,"Months","6 to 15",null,null,"MUTTABURRA","Western Queensland",800,870,null,"No Bids"]
[8266077,811,"Lot 811",74,"Heifers","Santa Gertrudis/Santa Cross",64,2,100,"Heifer","Backgrounder Heifers",false,284.10000000000002,149.5,"Months","6 to 15",null,null,"MUTTABURRA","Western Queensland",748,780,null,"No Bids"]
[8265062,812,"Lot 812",114,"Weaners","Brahman/Brahman Cross",51,"2 L",100,"Steer","Weaned Steers",false,276.10000000000002,143.6,"Months","12 to 14",null,null,"SPRINGSURE","Central Queensland",850.91,855.91,855.91,"Sold","MCC PASTORAL PTY LTD",-24.463100000000001,148.624,"ROLLESTON","QLD"]
[8264929,813,"Lot 813",80,"Heifers","Santa Gertrudis/Santa Gertrudis",70,1,93,"Heifer","Backgrounder Heifers",false,258.39999999999998,136,"Months","7 to 10",null,null,"MUNDUBBERA","Southern Queensland",720,775,755,"Passed In","HOURN & BISHOP QLD PTY LTD",-24.572199999999999,149.96700000000001,"MOURA","QLD"]
[8264937,814,"Lot 814",35,"Heifers","Angus/Angus Cross",66,1,91,"Heifer","Backgrounder Heifers",false,245.3,129.1,"Months","7 to 10",null,null,"MUNDUBBERA","Southern Queensland",680,735,755,"Sold","ALLIED BEEF",-27.560600000000001,151.95400000000001,"TOOWOOMBA","QLD"]
[8265070,815,"Lot 815",24,"Heifers","Droughtmaster/Droughtmaster",38,1,92,"Heifer","Feeder Heifers",false,322.3,174.9,"Months","10 to 14",null,null,"IRONPOT","Southern Queensland",850,900,null,"No Bids"]
[8265119,816,"Lot 816",26,"Heifers","Droughtmaster/Droughtmaster",27,1,100,"Heifer","Backgrounder Heifers",false,286.39999999999998,155.4,"Months","10 to 14",null,null,"IRONPOT","Southern Queensland",775,825,null,"No Bids"]
[8265470,817,"Lot 817",25,"Yearlings","Droughtmaster/Droughtmaster",100,"2 H",56,"Steer","Yearling Steers",false,375.1,199.2,"Months","12 to 16",null,null,"BUNGUNYA","Southern Queensland",1000,1050,1010,"Passed In","GRANT DANIEL & LONG GOONDIWINDI",-28.546399999999998,150.30699999999999,"GOONDIWINDI","QLD"]
[8265500,818,"Lot 818",12,"Yearlings","Angus/Droughtmaster",100,"3 L",42,"Steer","Yearling Steers",false,376.6,200,"Months","12 to 15",null,null,"BUNGUNYA","Southern Queensland",1000,1050,1010,"Passed In","GRANT DANIEL & LONG GOONDIWINDI",-28.546399999999998,150.30699999999999,"GOONDIWINDI","QLD"]
{"$rows_left_out":176}
{"sheet":"ckg table","index":4,"n_rows":2000,"n_cols":4,"rows_kept":2000,"cut":false,"hidden":true,"merged":[]}
[{"$f":"\"'Results'!\"&IF(MATCH(A$2,INDIRECT(\"Results!1:1\"),0)>=53,\"b\"&CHAR(64+MATCH(A$2,INDIRECT(\"Results!1:1\"),0)-52),IF(MATCH(A$2,INDIRECT(\"Results!1:1\"),0)>=27,\"A\"&CHAR(64+MATCH(A$2,INDIRECT(\"Results!1:1\"),0)-26),CHAR(64+MATCH(A$2,INDIRECT(\"Results!1:1\"),0))))","v":"'Results'!M"},"Price (c/kg)","State",{"$f":"ROW(A1)","v":1}]
["LiveWeight ",{"$f":"IFERROR((INDIRECT($A$3&ROW($A2))/INDIRECT($A$1&ROW($A2)))*100,\"\")","v":299.71455756422455},{"$f":"IFERROR(VLOOKUP(INDIRECT($A$5&ROW($A2)),'State Lookup'!$A:$B,2,FALSE),\"\")","v":"QLD"},{"$f":"ROW($A2)","v":2}]
[{"$f":"\"'Results'!\"&IF(MATCH(A4,INDIRECT(\"Results!1:1\"),0)>=53,\"b\"&CHAR(64+MATCH(A4,INDIRECT(\"Results!1:1\"),0)-52),IF(MATCH(A4,INDIRECT(\"Results!1:1\"),0)>=27,\"A\"&CHAR(64+MATCH(A4,INDIRECT(\"Results!1:1\"),0)-26),CHAR(64+MATCH(A4,INDIRECT(\"Results!1:1\"),0))))","v":"'Results'!W"},{"$f":"IFERROR((INDIRECT($A$3&ROW($A3))/INDIRECT($A$1&ROW($A3)))*100,\"\")","v":301.05973025048172},{"$f":"IFERROR(VLOOKUP(INDIRECT($A$5&ROW($A3)),'State Lookup'!$A:$B,2,FALSE),\"\")","v":"QLD"}]
["BidPrice ",307.50605326876513,{"$f":"IFERROR(VLOOKUP(INDIRECT($A$5&ROW($A4)),'State Lookup'!$A:$B,2,FALSE),\"\")","v":"QLD"}]
[{"$f":"\"'Results'!\"&IF(MATCH(A6,INDIRECT(\"Results!1:1\"),0)>=53,\"b\"&CHAR(64+MATCH(A6,INDIRECT(\"Results!1:1\"),0)-52),IF(MATCH(A6,INDIRECT(\"Results!1:1\"),0)>=27,\"A\"&CHAR(64+MATCH(A6,INDIRECT(\"Results!1:1\"),0)-26),CHAR(64+MATCH(A6,INDIRECT(\"Results!1:1\"),0))))","v":"'Results'!T"},307.11444984533802,{"$f":"IFERROR(VLOOKUP(INDIRECT($A$5&ROW($A5)),'State Lookup'!$A:$B,2,FALSE),\"\")","v":"QLD"}]
["DeliveryRegion ",313.56655290102384,{"$f":"IFERROR(VLOOKUP(INDIRECT($A$5&ROW($A6)),'State Lookup'!$A:$B,2,FALSE),\"\")","v":"QLD"}]
[null,266.52452025586354,{"$f":"IFERROR(VLOOKUP(INDIRECT($A$5&ROW(#REF!)),'State Lookup'!$A:$B,2,FALSE),\"\")","v":""}]
[null,270.01421127427761,{"$f":"IFERROR(VLOOKUP(INDIRECT($A$5&ROW(#REF!)),'State Lookup'!$A:$B,2,FALSE),\"\")","v":""}]
[null,267.97107613781372,{"$f":"IFERROR(VLOOKUP(INDIRECT($A$5&ROW($A9)),'State Lookup'!$A:$B,2,FALSE),\"\")","v":"QLD"}]
[null,276.78571428571428,{"$f":"IFERROR(VLOOKUP(INDIRECT($A$5&ROW($A10)),'State Lookup'!$A:$B,2,FALSE),\"\")","v":"QLD"}]
[null,334.78260869565219,{"$f":"IFERROR(VLOOKUP(INDIRECT($A$5&ROW($A11)),'State Lookup'!$A:$B,2,FALSE),\"\")","v":"QLD"}]
[null,0,{"$f":"IFERROR(VLOOKUP(INDIRECT($A$5&ROW($A12)),'State Lookup'!$A:$B,2,FALSE),\"\")","v":"QLD"}]
[null,0,{"$f":"IFERROR(VLOOKUP(INDIRECT($A$5&ROW($A13)),'State Lookup'!$A:$B,2,FALSE),\"\")","v":"QLD"}]
[null,309.99999999999994,{"$f":"IFERROR(VLOOKUP(INDIRECT($A$5&ROW($A14)),'State Lookup'!$A:$B,2,FALSE),\"\")","v":"QLD"}]
[null,292.18266253869973,{"$f":"IFERROR(VLOOKUP(INDIRECT($A$5&ROW($A15)),'State Lookup'!$A:$B,2,FALSE),\"\")","v":"QLD"}]
[null,307.78638401956783,{"$f":"IFERROR(VLOOKUP(INDIRECT($A$5&ROW($A16)),'State Lookup'!$A:$B,2,FALSE),\"\")","v":"QLD"}]
[null,0,{"$f":"IFERROR(VLOOKUP(INDIRECT($A$5&ROW($A17)),'State Lookup'!$A:$B,2,FALSE),\"\")","v":"QLD"}]
[null,0,{"$f":"IFERROR(VLOOKUP(INDIRECT($A$5&ROW($A18)),'State Lookup'!$A:$B,2,FALSE),\"\")","v":"QLD"}]
[null,269.26153025859765,{"$f":"IFERROR(VLOOKUP(INDIRECT($A$5&ROW($A19)),'State Lookup'!$A:$B,2,FALSE),\"\")","v":"QLD"}]
[null,268.18906001062135,{"$f":"IFERROR(VLOOKUP(INDIRECT($A$5&ROW($A20)),'State Lookup'!$A:$B,2,FALSE),\"\")","v":"QLD"}]
{"$rows_left_out":1981}
{"sheet":"State Lookup","index":5,"n_rows":56,"n_cols":2,"rows_kept":56,"cut":false,"hidden":true,"merged":[]}
["Region","State"]
["Central & Hills S.A.","SA"]
["CENTRAL COAST NSW","NSW"]
["Central Queensland","QLD"]
["Central Victoria","VIC"]
["Central Western NSW","NSW"]
["Eastern Pastoral S.A.","SA"]
["Esperance/Dundas W.A.","WA"]
["Far North Coast NSW","NSW"]
["Flinders Island","TAS"]
["Gascoyne W.A.","WA"]
["Gippsland Victoria","VIC"]
["Greenough W.A.","WA"]
["Hunter NSW","NSW"]
["ILLAWARRA NSW","NSW"]
["Kangaroo Island S.A.","SA"]
["Kimberley W.A.","WA"]
["Lower Great Southern W.A.","WA"]
["Lower SE S.A.","SA"]
["METROPOLITAN NSW","NSW"]
{"$rows_left_out":36}